program: Gaussian 09
title: 000069876
version: EM64L-G09RevD.01
frameworkgroup: C1[X(C10H9FO)]
method: RPBEPBE
basis: SDD
operation: Freq
keyword: #p
keyword: freq=noraman
keyword: PBEPBE/SDD
title: #p freq=noraman PBEPBE/SDD
converged: YES YES NO NO
title: Mulliken charges:
elementType: F O C C C C C C C C C C H H H H H H H H H
charge: -0.197131 -0.242909 -0.333709 -0.474632 -0.473953 0.154178 0.323166 -0.310901 -0.318749 -0.383542 -0.371126 0.331347 0.234992 0.267980 0.245292 0.245104 0.268661 0.228057 0.287112 0.259240 0.261523
chargesum: 0.00000
title: Mulliken charges with hydrogens summed into heavy atoms:
elementType: F O C C C C C C C C C C
charge: -0.197131 -0.242909 -0.098717 0.038640 0.039812 0.154178 0.323166 -0.082844 -0.031637 -0.124302 -0.109603 0.331347
polarizability: 1.66982029e+02 -7.19162947e-02 1.06205186e+02 -9.71545136e-02 1.38580980e-01 5.86376781e+01
1716.lowfreq: -14.7221 -11.2641 -6.1124 -0.0011 -0.0010 -0.0004 3.2736 39.4529 111.4990
frequency: -14.1002 39.3549 111.4913 140.4141 245.2361 270.8850 288.3052 314.0156 373.9761 409.4231 454.9109 494.8525 576.5001 625.3210 681.3767 710.9967 747.1857 786.4664 790.3303 806.0059 818.2985 848.6929 863.6056 883.7683 948.4276 991.0132 993.0750 1007.1485 1050.5596 1080.0260 1081.5137 1087.8582 1109.8061 1156.8895 1178.9631 1192.6930 1213.7017 1228.4261 1293.8113 1371.0398 1390.1788 1411.2813 1422.5929 1443.7998 1491.8530 1552.6667 1598.8688 1609.3398 3101.3523 3107.9586 3156.2227 3158.5944 3170.3690 3178.4025 3182.3470 3208.8950 3227.5187
redmass: 2.8996 4.2637 8.5768 4.8152 3.3729 4.6226 7.8980 5.0705 7.7212 2.9012 5.5519 2.9092 6.8312 7.1945 3.7861 2.5862 3.8982 2.5668 1.4963 2.5169 1.3155 1.4035 5.2116 1.8080 1.3958 1.3589 4.1921 2.3689 1.2131 1.2912 1.2508 1.2582 1.3519 1.4104 1.3737 2.3307 2.9930 2.1103 1.2991 3.5682 2.9711 3.3568 1.0879 1.3781 2.6036 8.0078 7.3119 6.7775 1.0499 1.0613 1.0893 1.0889 1.0903 1.0963 1.0967 1.1182 1.1159
irintensity: 0.9504 0.5487 3.7289 1.4664 0.1116 10.6749 2.1772 0.2379 3.8328 0.0091 0.1625 12.9927 25.0468 1.0952 12.9131 1.2745 13.8206 1.2649 13.5037 7.8101 6.5992 75.8933 12.1389 0.2295 0.6865 1.0732 131.0019 12.8216 16.6697 6.8467 8.1969 0.0432 15.0349 85.6639 0.2295 4.9829 48.7897 187.8120 8.4808 38.5327 137.3062 57.2905 12.3230 19.1842 17.0641 81.7110 45.1453 91.3344 15.8313 11.3085 6.7638 0.1855 4.9700 6.2132 6.8960 0.3034 10.5533
temp: 298.150 k
press: 1.00000 atm
elementType: 9 8 6 6 6 6 6 6 6 6 6 6 1 1 1 1 1 1 1 1 1
symmnumber: 1
zpe: 422751.9 jmol-1
zpe.correction: 0.161018 hartree
zpe.thermalcorrener: 0.170575 hartree
zpe.thermalcorrenthalpy: 0.171520 hartree
zpe.thermalcorrgfe: 0.125334 hartree
zpe.sumelectzpe: -560.639642 hartree
zpe.sumelectthermal: -560.630084 hartree
zpe.sumelectthermalent: -560.629140 hartree
zpe.sumelectthermalfe: -560.675325 hartree
dipole: 0.9073 -2.6407 0.0597
dipole: 2.7929
quadrupole: -73.7226 -64.9768 -70.8977
quadrupole: -8.5029 0.1477 0.1408
quadrupole: -3.8569 4.8889 -1.0320 -8.5029 0.1477 0.1408
hfenergy: -560.8006595 hartree
pointgroup: C01 [X(C10H9F1O1)]
dipole: 0.3500684 -0.9805298 0.3512675 debye
dipolederiv: -1.2759375 -0.0626427 0.1544029 -0.0803233 -0.2075369 0.0307373 0.1602454 0.0287784 -0.1783181 -0.8207605 -0.0837112 0.0874034 -0.0711038 -0.7467889 0.1706564 0.0764182 0.1731858 -0.4200657 -1.1162565 0.3598956 -0.0108581 0.2848564 -0.111977 0.00295 0.0300542 -0.0083332 -0.0107121 0.31673 -0.1302824 0.012325 0.1730431 0.0386735 -0.0448279 0.18058 -0.0584423 -0.0712636 0.2398019 -0.1254115 0.0058651 -0.0455579 0.0477728 -0.0603662 -0.3258626 0.0027581 -0.0147214 1.9469493 -0.1422702 -0.1486649 -0.4056167 0.7764972 -0.1989067 -0.034205 -0.2286739 0.2609874 -0.8386568 -0.0135829 0.1015323 0.0213391 -0.1319182 0.0435843 0.0826635 0.046925 -0.0418476 0.2116176 -0.0196285 -0.0308685 0.1232979 0.0554957 -0.0731796 -0.0906683 -0.0561908 -0.0769122 0.1823803 0.0407545 -0.0468209 -0.1419646 0.0517766 -0.0342773 0.0273345 -0.0575302 -0.0711315 -0.4092681 0.0442589 0.0124661 0.2741214 -0.052074 -0.0731647 -0.0714285 -0.0466777 -0.139761 -0.2840918 -0.1101139 0.0546392 -0.2972557 -0.0821444 0.0054976 0.123411 -0.0170033 -0.1716241 1.3988043 0.0611197 -0.1728554 0.0644157 0.3294153 -0.0882918 -0.1732968 -0.0876711 0.1621288 -0.0037323 -0.0625721 0.0417261 -0.0428586 -0.041057 0.0703675 0.0328841 0.0713545 0.0789336 0.087346 0.0417043 0.0064698 -0.0087009 0.0395169 0.0806431 0.0306138 0.027399 -0.0151304 0.0231371 0.0809668 0.0359869 0.065851 -0.0621584 -0.0583801 0.0518974 -0.0361106 0.0599012 -0.008295 0.045593 -0.0849156 0.0291632 0.0419618 0.0755635 -0.087483 0.0493105 -0.0115019 0.0758271 0.0141497 -0.0396712 -0.050504 -0.0377455 -0.0415187 -0.0168249 -0.0025592 0.0793091 0.0555631 0.0960452 -0.0247289 0.106179 -0.0030016 0.039936 -0.0278143 0.0412819 0.1281406 0.1405132 -0.0587216 0.0222462 -0.0145968 0.0441289 0.0406392 0.0043909 0.0471394 0.1340786 0.0571455 -0.0428774 0.0304435 -0.0591584 0.013964 0.0685473 0.0364237 0.066583 0.1540206 0.0211831 0.0673265 -0.0061231 0.075374 0.037199 0.0437907 -0.0093333 0.0444768 0.1654897 unknown
polarizability: 165.7167364|-4.5220819|100.6643043|-10.7165487|-15.0359629|65.4438515 unknown
InChI: InChI=1S/C10H9FO/c11-9-5-3-8(4-6-9)10(12)7-1-2-7/h3-7H,1-2H2
charge 0 multiplicity 1
21 atoms
F  -4.263442 -0.190034 0.509525
O  1.788718 1.417656 -0.825732
C  2.331451 -0.770654 -0.00666
C  3.572776 -0.919663 -0.931239
C  3.751094 -0.340933 0.456766
C  1.364342 0.321408 -0.336178
C  -0.108743 0.129864 -0.09097
C  -0.674252 -1.07202 0.415879
C  -0.971224 1.221572 -0.392297
C  -2.065406 -1.187558 0.619222
C  -2.360633 1.127392 -0.195426
C  -2.87572 -0.082027 0.308408
H  1.940385 -1.691592 0.428735
H  3.613339 -0.221612 -1.771682
H  3.917585 -1.937014 -1.135054
H  4.222636 -0.949519 1.233041
H  3.908497 0.738482 0.529725
H  -0.042145 -1.931759 0.654914
H  -0.517294 2.137458 -0.783482
H  -2.517293 -2.104786 1.007031
H  -3.035071 1.958038 -0.421727
