program: Gaussian 09
title: 000069863
version: EM64L-G09RevD.01
frameworkgroup: C1[X(C7H7Cl3Si)]
method: RPBEPBE
basis: SDD
operation: Freq
keyword: #p
keyword: freq=noraman
keyword: PBEPBE/SDD
title: #p freq=noraman PBEPBE/SDD
converged: NO YES NO NO
title: Mulliken charges:
elementType: Cl Cl Cl Si C C C C C C C H H H H H H H
charge: -0.243433 -0.237482 -0.237482 0.836396 -0.983722 0.492796 -0.368226 -0.368217 -0.217069 -0.217073 -0.234716 0.300775 0.300778 0.239879 0.239875 0.231628 0.231630 0.233664
chargesum: 0.00000
title: Mulliken charges with hydrogens summed into heavy atoms:
elementType: Cl Cl Cl Si C C C C C C C
charge: -0.243433 -0.237482 -0.237482 0.836396 -0.382169 0.492796 -0.128347 -0.128342 0.014559 0.014557 -0.001051
polarizability: 1.59937132e+02 7.02124441e-05 1.24653188e+02 -2.13288952e+01 -1.00290643e-04 8.52527943e+01
1716.lowfreq: -0.0029 0.0009 0.0026 5.8943 9.2759 13.6122 29.3253 52.9929 53.5091
frequency: 28.5357 52.9843 53.5022 112.9583 119.5032 166.9807 171.4274 173.1998 255.1726 333.2787 372.9599 402.7977 482.0825 502.0829 504.5544 566.8233 616.6610 697.4238 702.2451 778.1956 805.5066 838.8877 854.2476 923.5595 978.0928 989.2806 999.4504 1026.5706 1073.9036 1136.0129 1175.7758 1191.6944 1209.2546 1234.3755 1328.2868 1383.2328 1410.9960 1442.0647 1482.2438 1592.5785 1611.5900 3003.6528 3070.1783 3124.5090 3125.8173 3139.0022 3150.7650 3167.2314
redmass: 6.1055 9.8153 4.9376 12.9376 9.2012 8.1982 16.5743 10.1346 8.9540 2.0151 9.4663 2.8062 3.9966 16.7653 17.8924 5.3480 6.3444 5.7937 1.6356 1.9846 4.6428 1.5835 1.3223 1.4104 1.3889 6.1198 1.3257 2.2342 1.5458 1.0893 1.0513 1.1182 2.6042 1.3563 1.2708 8.4340 1.1073 2.1931 2.2808 6.0433 6.1010 1.0585 1.1019 1.0857 1.0884 1.0918 1.0963 1.1017
irintensity: 0.0069 0.4809 0.3505 0.9387 0.2661 6.9572 7.1496 3.5535 4.1739 0.0004 35.5323 0.1504 47.4383 94.9754 120.1267 28.6850 0.3265 13.4407 34.9261 73.0002 6.8041 29.0342 4.7460 3.0548 0.1429 0.4422 0.0643 6.0713 19.5904 0.8335 0.0010 0.3944 0.3619 4.1080 0.6229 0.0205 14.9147 10.0749 17.0546 1.2774 1.9210 3.9083 0.0427 5.9378 0.6815 11.7428 30.3664 18.5860
temp: 298.150 k
press: 1.00000 atm
elementType: 17 17 17 14 6 6 6 6 6 6 6 1 1 1 1 1 1 1
symmnumber: 1
zpe: 320372.7 jmol-1
zpe.correction: 0.122024 hartree
zpe.thermalcorrener: 0.134016 hartree
zpe.thermalcorrenthalpy: 0.134960 hartree
zpe.thermalcorrgfe: 0.081044 hartree
zpe.sumelectzpe: -1939.825181 hartree
zpe.sumelectthermal: -1939.813189 hartree
zpe.sumelectthermalent: -1939.812245 hartree
zpe.sumelectthermalfe: -1939.866161 hartree
dipole: -3.1266 0.0000 -1.8579
dipole: 3.6370
quadrupole: -93.8687 -90.5757 -96.1780
quadrupole: 0.0000 -3.0952 -0.0001
quadrupole: -0.3279 2.9651 -2.6372 0.0000 -3.0952 -0.0001
hfenergy: -1939.9472048 hartree
pointgroup: C01 [X(C7H7Cl3Si1)]
dipole: -1.2379237 -0.0000585 -0.7176248 debye
dipolederiv: -0.9871064 0.0000988 0.1980851 0.0001241 -0.3039158 -0.0000518 0.2786295 -0.0000589 -0.4597834 -0.3621609 0.0192131 0.0133573 -0.0695142 -0.6203179 -0.236583 -0.1284163 -0.2139036 -0.4746924 -0.3621499 -0.0192608 0.0134123 0.0694033 -0.6201273 0.2366418 -0.1284005 0.2139805 -0.4748818 1.7955315 -0.0000548 -0.2592667 -0.0000153 1.6802944 -0.0000014 -0.0561799 -0.0000135 1.5532033 -0.1557616 0.0000239 0.133836 0.0000177 -0.2472003 -0.0000041 0.1381476 -0.0000049 -0.2132531 0.2024614 -0.0000238 -0.0413477 -0.0000646 -0.0205266 -0.0000051 -0.2524879 0.0000093 -0.054044 -0.1067497 0.0845289 -0.0351669 0.0194004 0.0281158 -0.0283928 -0.016239 -0.0116727 -0.1200286 -0.1067655 -0.0845256 -0.0351325 -0.0193968 0.0281471 0.0283465 -0.0162348 0.0116306 -0.1200357 -0.0482008 -0.0895345 -0.0508325 -0.1151597 0.0909976 0.0260734 -0.0219343 0.0420245 -0.1113512 -0.0481766 0.089529 -0.0508712 0.1151636 0.0909429 -0.0261489 -0.021989 -0.0421087 -0.1113222 0.047124 -0.0000264 -0.1041197 -0.0000247 -0.0587895 -0.0000046 -0.0937696 -0.0000058 -0.1132356 0.0252009 -0.0408385 -0.0265079 0.052138 0.0204398 -0.0624916 0.0213787 -0.074822 0.0339319 0.0251993 0.0408239 -0.0265135 -0.0521252 0.0205042 0.0624996 0.0214128 0.0748264 0.0338735 0.0467283 -0.0950022 0.0498062 -0.0836515 -0.0264947 0.0241662 0.0342003 0.0259114 0.1158297 0.0467493 0.0950143 0.0497684 0.0836592 -0.0265401 -0.0241203 0.0341712 -0.0258679 0.1158414 0.0390676 0.0738651 0.0378257 0.0950085 -0.0630375 -0.0312617 0.0551541 -0.0319071 0.1396312 0.0390495 -0.0738616 0.0378594 -0.0949958 -0.062987 0.031338 0.0551966 0.0319811 0.1396062 -0.0900403 0.0000312 0.0958082 0.000033 0.0904949 -0.0000004 0.0973607 0.0000014 0.1207109 unknown
polarizability: 159.4678575|-0.006475|124.6531868|-22.1302715|-0.0060478|85.722069 unknown
InChI: InChI=1S/C7H7Cl3Si/c8-11(9,10)6-7-4-2-1-3-5-7/h1-5H,6H2
charge 0 multiplicity 1
18 atoms
Cl 4.136267 -0.000566 -0.969465
Cl 2.122997 1.77181 1.329372
Cl 2.122648 -1.771582 1.330121
Si 2.217025 -0.000166 0.067416
C  0.81637 -0.000322 -1.223831
C  -0.585085 -0.000106 -0.638171
C  -1.249146 1.222893 -0.359032
C  -1.249298 -1.222903 -0.358544
C  -2.553374 1.222953 0.182472
C  -2.553518 -1.222604 0.182965
C  -3.210433 0.000268 0.454395
H  0.990886 -0.891916 -1.854707
H  0.991015 0.890974 -1.855088
H  -0.743894 2.174426 -0.563627
H  -0.744168 -2.174579 -0.562791
H  -3.055267 2.174373 0.390515
H  -3.05553 -2.173875 0.391395
H  -4.222796 0.000421 0.873205
