program: Gaussian 09
title: 000069859
version: EM64L-G09RevD.01
frameworkgroup: C1[X(C6H2F4S)]
method: RPBEPBE
basis: SDD
operation: Freq
keyword: #pfreq=noraman
keyword: PBEPBE/SDD
title: #p freq=noraman PBEPBE/SDD
converged: NO YES NO YES
title: Mulliken charges:
elementType: S F F F F C C C C C C H H
charge: 0.105225 -0.156589 -0.173817 -0.169065 -0.168040 -0.555313 0.243806 0.327825 0.285510 0.276502 -0.465323 0.297124 0.152155
chargesum: 0.00000
title: Mulliken charges with hydrogens summed into heavy atoms:
elementType: S F F F F C C C C C C
charge: 0.257380 -0.156589 -0.173817 -0.169065 -0.168040 -0.555313 0.243806 0.327825 0.285510 0.276502 -0.168199
polarizability: 1.16504604e+02 4.62511013e-01 9.28328363e+01 -3.23285240e-04 2.31994753e-03 3.13397055e+01
1716.lowfreq: 0.0011 0.0023 0.0028 6.9618 8.5675 12.3454 116.9182 120.5214 185.6484
frequency: 116.9164 120.5213 185.6477 191.2915 253.4237 262.3816 279.2643 288.3920 293.3078 389.9063 406.2219 414.6517 483.4844 521.9000 626.1239 632.7797 673.4482 710.4312 819.7084 821.2824 851.3427 953.1586 1059.5869 1158.8870 1166.3261 1336.9723 1381.1931 1396.4020 1465.0296 1601.6169 1613.0236 2435.3118 3200.6672
redmass: 15.5925 18.3851 13.5328 12.6279 1.0972 17.9847 18.0180 5.9683 17.7561 12.3456 14.9724 14.1770 17.0771 3.9878 5.2345 11.8773 10.6558 5.6417 1.5412 2.5335 10.5953 1.6203 9.4082 6.9024 1.5437 11.7387 11.3711 11.0795 6.2533 8.5567 11.3443 1.0376 1.0937
irintensity: 0.9592 0.0133 2.2081 1.7185 33.1139 0.0518 0.8716 4.7366 3.5207 0.0806 0.7028 0.2445 0.0950 0.1103 2.6914 0.0423 19.1016 9.1822 41.5407 96.5534 52.3019 30.7184 3.2571 28.7639 37.9435 0.2482 3.3263 49.7004 292.4206 20.9155 65.0477 0.9211 7.9037
temp: 298.150 k
press: 1.00000 atm
elementType: 16 9 9 9 9 6 6 6 6 6 6 1 1
symmnumber: 1
zpe: 168138.7 jmol-1
zpe.correction: 0.064041 hartree
zpe.thermalcorrener: 0.073935 hartree
zpe.thermalcorrenthalpy: 0.074880 hartree
zpe.thermalcorrgfe: 0.028561 hartree
zpe.sumelectzpe: -1026.440984 hartree
zpe.sumelectthermal: -1026.431090 hartree
zpe.sumelectthermalent: -1026.430146 hartree
zpe.sumelectthermalfe: -1026.476464 hartree
dipole: 0.1200 1.1141 0.0003
dipole: 1.1205
quadrupole: -62.1330 -79.0875 -67.9318
quadrupole: 3.5777 0.0012 0.0009
quadrupole: 7.5844 -9.3700 1.7856 3.5777 0.0012 0.0009
hfenergy: -1026.5050252 hartree
pointgroup: C01 [X(C6H2F4S1)]
dipole: -0.4396773 0.0320357 0.0000748 debye
dipolederiv: 0.2156304 0.1186536 -0.0001541 0.0937603 -0.4139691 0.0001148 -0.0001369 0.000217 -0.0714895 -0.7512616 -0.2432419 -0.000003 -0.3219015 -0.2972239 0.0000126 0.0000522 0.0000599 -0.0974566 -0.7614491 0.2298484 -0.0001617 0.2993834 -0.2995399 0.0001137 -0.0001674 0.0000694 -0.1047185 -0.7848347 -0.4096264 0.0000658 -0.3641484 -0.4514044 0.0000714 0.0000221 0.000029 -0.1151602 -0.7958793 0.4017844 -0.0002111 0.3666325 -0.4342254 0.0001465 -0.0001752 0.0001331 -0.1134514 -0.1934817 -0.1676926 0.0000973 -0.0353926 0.8463366 -0.0004305 0.0000701 -0.0004366 -0.1067856 0.7688713 0.3691566 -0.0000285 0.5040993 -0.0442313 0.0001626 -0.0001241 0.0000449 0.0998204 0.7370748 -0.2831341 0.0001904 -0.4624046 -0.1233005 0.0000242 0.0001781 0.0001484 0.0730253 0.8939708 0.3456958 -0.0000339 0.4653738 0.6558012 -0.0001177 -0.0000309 -0.0001106 0.1031533 0.9007117 -0.3511949 0.0001943 -0.4983743 0.6506104 -0.000236 0.000246 -0.0002143 0.0848872 -0.3137098 -0.0120721 -0.0000088 0.0150078 -0.2526635 0.0000167 -0.0000246 0.0000103 -0.1673812 0.1122522 0.001028 -0.0000107 -0.0005425 0.0730656 0.0000445 -0.0000121 0.000053 0.2158637 -0.0278949 0.0007952 0.0000641 -0.0614932 0.090744 0.0000771 0.0001027 -0.0000035 0.199693 unknown
polarizability: 92.8931378|-1.2797365|116.4442917|0.0051014|-0.030165|31.3397165 unknown
InChI: InChI=1S/C6H2F4S/c7-2-1-3(8)5(10)6(11)4(2)9/h1,11H
charge 0 multiplicity 1
13 atoms
S  0.051296 2.957166 -0.001326
F  2.406645 1.107598 -0.000262
F  -2.438184 1.080153 -0.000818
F  -2.417797 -1.697487 0.000081
F  2.418903 -1.671481 0.000612
C  -0.01354 1.139763 -0.000502
C  1.197697 0.412355 -0.000133
C  -1.214604 0.397155 -0.00046
C  -1.204324 -1.009924 0.000027
C  1.199229 -0.996162 0.00029
C  0.001232 -1.728385 0.000356
H  0.007281 -2.820365 0.000685
H  -1.325434 3.120916 -0.00105
