program: Gaussian 09
title: 000069891
version: EM64L-G09RevD.01
frameworkgroup: C1[X(C11H18O2Si)]
method: RPBEPBE
basis: SDD
operation: Freq
keyword: #p
keyword: freq=noraman
keyword: PBEPBE/SDD
title: #p freq=noraman PBEPBE/SDD
converged: NO YES NO NO
title: Mulliken charges:
elementType: Si O O C C C C C C C C C C C H H H H H H H H H H H H H H H H H H
charge: 1.490990 -0.611412 -0.587117 -0.273057 -1.054728 -0.297872 -0.295283 -0.196260 -0.202445 -0.237596 -0.224500 -0.231353 -0.663142 -0.664606 0.255935 0.253662 0.245229 0.237247 0.274516 0.195345 0.201159 0.205490 0.202393 0.227408 0.227185 0.228286 0.199322 0.225890 0.223875 0.198459 0.225179 0.221807
chargesum: 0.00000
title: Mulliken charges with hydrogens summed into heavy atoms:
elementType: Si O O C C C C C C C C C C C
charge: 1.490990 -0.611412 -0.587117 -0.273057 -0.299903 -0.060625 -0.020767 0.200243 0.205437 -0.010188 0.002684 -0.003067 -0.014057 -0.019162
polarizability: 1.73983752e+02 2.09889298e+00 1.44413496e+02 -6.58990935e+00 1.45240694e+01 1.16787193e+02
1716.lowfreq: -8.5871 -4.8491 0.0014 0.0015 0.0017 7.2547 14.9920 24.5064 30.9274
frequency: 14.9070 24.4572 30.8769 47.8905 53.2974 62.5306 80.1813 118.7904 133.5788 138.0862 200.6096 213.2152 237.4583 247.0269 257.6503 269.2700 275.6390 361.0708 393.5771 394.6137 444.1431 483.7788 609.3458 614.9567 682.7554 689.5917 708.2644 740.0557 762.2431 803.4288 805.6621 855.4777 865.9133 867.4199 930.5922 933.5605 939.7948 985.9474 987.1439 1003.8151 1024.4273 1056.0595 1067.3906 1074.0617 1101.9999 1102.6256 1110.9879 1134.6235 1136.3468 1172.5181 1192.5909 1259.3251 1261.6671 1308.7495 1311.2841 1360.6644 1361.9677 1368.3851 1389.0372 1389.2821 1420.0764 1439.9099 1446.8771 1457.8343 1458.1002 1468.8620 1476.4666 1477.3468 1489.1932 1491.3781 1578.3103 1599.9899 2942.6821 2950.0639 2987.8329 2988.4438 2995.1136 2996.7780 3003.9190 3085.1893 3085.9583 3098.8153 3099.4882 3100.3025 3103.9296 3109.4213 3122.6273 3135.7977 3148.3731 3160.8669
redmass: 2.7532 2.7641 3.5706 1.8458 2.5305 3.8109 3.6818 2.7499 1.2760 2.2240 3.1504 2.6145 2.0879 1.3643 2.9586 2.7309 2.8008 4.5089 3.0379 3.3405 5.2727 3.7058 4.8727 6.3681 3.8738 4.9525 1.8642 2.2759 3.0927 1.0912 1.0893 1.4503 1.2523 1.4492 2.6277 1.3895 2.7107 1.3978 5.8821 1.3185 2.7760 4.3353 4.5949 1.6890 2.1215 2.1597 2.9167 1.4641 1.4797 1.0564 1.1251 1.1330 1.1321 1.3344 1.2388 1.2754 1.2777 5.0704 1.2580 1.2581 2.1313 1.0523 1.0496 1.0417 1.0418 2.0620 1.0515 1.0477 1.0793 1.0818 5.6827 5.8582 1.0561 1.0562 1.0359 1.0359 1.0530 1.0862 1.1069 1.0985 1.0985 1.1013 1.0982 1.1011 1.0989 1.0874 1.0864 1.0918 1.0955 1.1013
irintensity: 0.0318 0.1682 0.2235 2.4244 0.9414 0.5501 6.0288 0.8794 1.0652 3.0802 0.4979 6.9059 3.8107 1.0299 2.1275 12.2852 8.5036 16.6148 0.3434 0.8918 41.8016 27.7234 17.0031 1.1283 40.3185 13.8746 47.3218 108.2699 23.7315 1.5198 3.1120 71.1997 3.2870 78.3865 90.8973 2.4199 148.5893 0.0433 0.2259 0.0624 1.5881 274.3424 242.1159 5.5196 6.6364 2.6310 64.1190 4.4806 6.2169 0.2483 3.0003 0.9786 0.8170 8.1935 45.7028 11.2534 17.0256 0.1733 12.4416 47.6635 17.1073 5.1614 11.5210 10.0066 11.0163 5.4836 5.1254 5.3528 8.0369 0.2598 0.1491 1.1824 65.3609 47.6250 35.9682 24.4149 6.4079 37.5958 40.6327 38.4724 41.1689 33.6783 22.2869 38.6067 11.2923 6.0358 0.8295 20.1730 25.0677 31.6392
temp: 298.150 k
press: 1.00000 atm
elementType: 14 8 8 6 6 6 6 6 6 6 6 6 6 6 1 1 1 1 1 1 1 1 1 1 1 1 1 1 1 1 1 1
symmnumber: 1
zpe: 696062.5 jmol-1
zpe.correction: 0.265116 hartree
zpe.thermalcorrener: 0.282739 hartree
zpe.thermalcorrenthalpy: 0.283683 hartree
zpe.thermalcorrgfe: 0.215981 hartree
zpe.sumelectzpe: -868.777183 hartree
zpe.sumelectthermal: -868.759560 hartree
zpe.sumelectthermalent: -868.758616 hartree
zpe.sumelectthermalfe: -868.826318 hartree
dipole: -0.0962 -0.1619 -0.1882
dipole: 0.2662
quadrupole: -81.9724 -90.4480 -91.1896
quadrupole: 3.3459 -0.4406 -0.2545
quadrupole: 5.8976 -2.5781 -3.3196 3.3459 -0.4406 -0.2545
hfenergy: -869.0422995 hartree
pointgroup: C01 [X(C11H18O2Si1)]
dipole: -0.0388584 -0.058404 -0.0777767 debye
polarizability: 173.2021593|4.2702963|141.9813243|-8.8895963|16.2784977|120.0009564 unknown
InChI: InChI=1S/C11H18O2Si/c1-4-12-14(3,13-5-2)11-9-7-6-8-10-11/h6-10H,4-5H2,1-3H3
charge 0 multiplicity 1
32 atoms
Si -0.800256 0.007011 0.773762
O  -1.667816 -1.167885 -0.165161
O  -1.337499 1.626876 0.44825
C  0.98946 -0.242816 0.201172
C  -1.115231 -0.182745 2.628449
C  2.01195 0.65534 0.615226
C  1.338739 -1.326849 -0.648716
C  -3.096758 -1.474371 -0.037222
C  -1.210195 2.308478 -0.848664
C  3.350005 0.470624 0.198047
C  2.676027 -1.513013 -1.067787
C  3.684253 -0.61636 -0.643418
C  -3.438928 -2.572027 -1.046305
C  -1.500191 3.794869 -0.633126
H  -0.474985 0.511892 3.200084
H  -2.166133 0.051591 2.873324
H  -0.893535 -1.211271 2.963407
H  1.766255 1.507928 1.26197
H  0.552506 -2.013895 -0.980663
H  -3.318761 -1.813889 0.997202
H  -3.69715 -0.561593 -0.233199
H  -0.188353 2.160771 -1.257618
H  -1.93173 1.867952 -1.566902
H  4.126974 1.170707 0.526115
H  2.930445 -2.353638 -1.723692
H  4.721569 -0.761104 -0.967171
H  -4.510903 -2.838197 -0.983669
H  -3.219316 -2.23016 -2.072506
H  -2.838366 -3.476465 -0.846849
H  -1.436637 4.3457 -1.59051
H  -2.512489 3.930734 -0.214553
H  -0.773351 4.230806 0.074123
