program: Gaussian 09
title: 000069877
version: EM64L-G09RevD.01
frameworkgroup: C1[X(C10H18O2)]
method: RPBEPBE
basis: SDD
operation: Freq
keyword: #pfreq=noraman
keyword: PBEPBE/SDD
title: #p freq=noraman PBEPBE/SDD
converged: YES YES NO NO
title: Mulliken charges:
elementType: O O C C C C C C C C C C H H H H H H H H H H H H H H H H H H
charge: -0.283695 -0.255890 0.074073 -0.447311 -0.469186 -0.410386 -0.379351 -0.373606 -0.397411 -0.405524 0.274409 -0.760519 0.222133 0.207992 0.234338 0.215750 0.211842 0.192431 0.224302 0.196937 0.202092 0.194502 0.198079 0.206037 0.199388 0.198233 0.193911 0.244849 0.247490 0.244092
chargesum: 0.00000
title: Mulliken charges with hydrogens summed into heavy atoms:
elementType: O O C C C C C C C C C C
charge: -0.283695 -0.255890 0.296205 -0.004980 -0.041594 0.006347 0.019678 0.018975 0.008014 -0.013380 0.274409 -0.024089
polarizability: 1.34490682e+02 -9.67162843e-01 1.08627535e+02 1.34717919e+00 2.75227083e+00 9.01652450e+01
1716.lowfreq: -17.3275 -8.5246 -0.0007 -0.0005 0.0004 8.4321 23.7621 56.8209 62.4880
frequency: 8.7607 56.7076 62.1403 84.5680 132.1441 194.1725 202.9934 227.6958 253.5629 287.7437 328.5400 368.5023 372.3780 413.0397 468.0386 502.4049 515.4514 571.0956 626.7701 718.6749 760.8396 782.3143 807.5090 822.1126 852.8281 868.3099 911.5374 951.0130 962.8719 971.7135 996.3869 1022.8484 1036.3334 1042.6882 1090.3533 1110.1759 1118.7612 1136.4100 1148.2074 1179.9649 1204.7482 1225.9348 1232.0573 1254.4113 1274.7035 1284.6534 1304.6664 1311.3645 1329.4991 1340.4317 1351.6701 1356.6278 1364.6057 1367.1245 1370.3952 1382.0642 1453.2105 1455.6888 1461.0412 1463.9237 1466.7823 1469.3466 1471.7977 1487.5429 1505.0819 1635.4457 2956.1029 2969.2995 2973.6087 2975.0646 2977.8618 2985.6676 3002.5935 3003.9500 3005.5946 3014.8270 3018.4141 3028.1382 3032.8931 3037.0785 3045.3175 3062.4538 3097.8297 3138.1214
redmass: 1.0236 4.3023 5.0155 3.3612 2.3777 2.8220 2.6452 3.2757 2.8165 2.4021 1.8399 3.2347 3.8730 2.1485 1.9347 2.5096 2.2718 3.2025 4.1889 1.7167 1.7129 1.7113 2.7337 2.4602 2.3384 1.9460 4.7133 2.0173 1.6002 1.8776 1.8116 2.4762 2.2140 1.6606 1.3143 1.7023 1.9738 2.5392 2.0548 1.2605 3.3202 1.2283 1.2846 1.2380 1.2197 1.1261 1.2782 1.2730 1.3752 1.3954 1.4253 1.3909 1.4062 1.3302 1.4605 1.2564 1.0612 1.0535 1.0801 1.0852 1.0831 1.0876 1.0903 1.0827 1.0794 9.5135 1.0603 1.0601 1.0603 1.0640 1.0631 1.0644 1.0731 1.0387 1.0882 1.0874 1.0960 1.0984 1.0987 1.1009 1.1008 1.1006 1.0939 1.1024
irintensity: 0.3405 1.9884 1.3280 2.0714 1.1913 2.0736 3.5999 1.0895 1.9259 0.9522 0.2807 4.8703 4.2889 0.7553 0.8357 1.2721 3.1461 2.8552 5.5714 2.5098 2.5699 6.5104 1.3001 6.9308 9.5019 3.5117 80.7305 6.0100 8.0017 11.9215 60.8938 4.3969 21.2959 7.8381 0.7687 0.8792 3.3066 0.2744 1.4123 10.1502 354.3204 5.1619 0.0879 1.0966 2.0764 0.3178 3.1910 0.1716 0.1164 0.1479 0.1868 0.5701 0.0637 1.3300 4.1906 49.8414 22.2876 17.2580 0.9719 4.3639 9.0420 16.1124 10.7206 13.4092 21.4416 170.5552 26.9763 24.4533 22.8919 39.8907 25.1304 38.2745 21.4590 3.0948 9.0529 58.5532 22.5673 52.4395 45.9049 62.8936 67.8559 72.4950 10.4997 9.6075
temp: 298.150 k
press: 1.00000 atm
elementType: 8 8 6 6 6 6 6 6 6 6 6 6 1 1 1 1 1 1 1 1 1 1 1 1 1 1 1 1 1 1
symmnumber: 1
zpe: 694541.1 jmol-1
zpe.correction: 0.264537 hartree
zpe.thermalcorrener: 0.277523 hartree
zpe.thermalcorrenthalpy: 0.278468 hartree
zpe.thermalcorrgfe: 0.223299 hartree
zpe.sumelectzpe: -541.338237 hartree
zpe.sumelectthermal: -541.325250 hartree
zpe.sumelectthermalent: -541.324306 hartree
zpe.sumelectthermalfe: -541.379474 hartree
dipole: -0.8955 1.4275 0.9385
dipole: 1.9289
quadrupole: -68.7597 -77.0898 -74.4162
quadrupole: 4.0170 3.2563 -3.2361
quadrupole: 4.6622 -3.6679 -0.9943 4.0170 3.2563 -3.2361
hfenergy: -541.6027736 hartree
pointgroup: C01 [X(C10H18O2)]
dipole: -0.3629141 0.5477505 0.3796694 debye
polarizability: 134.5558328|-0.133045|108.5490857|0.5007244|2.9346373|90.1785434 unknown
InChI: InChI=1S/C10H18O2/c1-9(11)12-10-7-5-3-2-4-6-8-10/h10H,2-8H2,1H3
charge 0 multiplicity 1
30 atoms
O  1.769787 0.815991 0.187976
O  2.563727 -1.118617 -0.851726
C  0.345355 0.379657 -0.088775
C  -0.079379 -0.673273 0.965676
C  -0.440974 1.703337 -0.076024
C  -0.918699 -1.844693 0.387859
C  -1.933396 1.636025 -0.50149
C  -2.069651 -1.469574 -0.577202
C  -2.878883 0.840303 0.445553
C  -3.22327 -0.60774 -0.01033
C  2.781136 -0.042113 -0.245292
C  4.143127 0.498475 0.139258
H  0.352885 -0.076668 -1.096957
H  -0.614534 -0.168973 1.790498
H  0.835072 -1.107293 1.410724
H  0.085059 2.406923 -0.750167
H  -0.376236 2.133134 0.94378
H  -1.329273 -2.433124 1.233405
H  -0.227304 -2.515762 -0.159431
H  -2.01341 1.239795 -1.533946
H  -2.285396 2.684666 -0.556315
H  -2.510939 -2.415046 -0.953498
H  -1.646632 -0.97112 -1.472257
H  -3.837106 1.388758 0.539914
H  -2.445657 0.830829 1.463699
H  -3.999719 -0.540003 -0.800377
H  -3.696711 -1.143985 0.838176
H  4.399087 0.154881 1.158572
H  4.144417 1.599466 0.142905
H  4.90452 0.112143 -0.555309
