program: Gaussian 09
title: 000004388
version: EM64L-G09RevD.01
frameworkgroup: C1[X(C7H13NO5)]
method: RPBEPBE
basis: SDD
operation: Freq
keyword: #p
keyword: freq=noraman
keyword: PBEPBE/SDD
title: #p freq=noraman PBEPBE/SDD
converged: YES YES NO NO
title: Mulliken charges:
elementType: O O O O O N C C C C C C C H H H H H H H H H H H H H
charge: -0.463643 -0.441711 -0.290370 -0.414505 -0.216598 -0.333876 -0.195192 -0.152171 -0.377039 0.226371 -0.347843 -0.697427 0.180729 0.248759 0.235137 0.209601 0.252970 0.202484 0.244032 0.308174 0.194518 0.254783 0.225399 0.380361 0.374544 0.392514
chargesum: 0.00000
title: Mulliken charges with hydrogens summed into heavy atoms:
elementType: O O O O O N C C C C C C C
charge: -0.083282 -0.067167 -0.290370 -0.021990 -0.216598 -0.025703 0.053567 0.082966 0.085532 0.226371 0.098673 -0.022727 0.180729
polarizability: 1.21235863e+02 -1.24156631e+00 8.53194684e+01 2.10581034e+00 -2.50800244e+00 9.03730584e+01
1716.lowfreq: -14.7823 -9.7523 -0.0010 -0.0006 0.0002 7.4038 19.7198 35.8256 52.5829
frequency: 17.9908 35.0087 51.9939 57.4427 85.9127 118.7649 124.8682 170.1167 195.0227 225.4699 238.5396 265.9629 295.8506 344.8019 355.5193 407.6464 433.5087 484.6029 510.8036 544.1165 559.0369 578.8712 621.3097 626.0097 720.8960 767.5356 795.3831 830.8563 846.7971 860.7850 912.8886 955.0313 984.4929 1016.6756 1049.9346 1075.7726 1091.0093 1103.2401 1143.5960 1195.0464 1237.4471 1244.8926 1253.7370 1260.2880 1281.9744 1300.9344 1327.2142 1342.2302 1356.4653 1367.9142 1382.3207 1398.6396 1454.3149 1468.6019 1480.7984 1498.3850 1507.7227 1622.4706 1670.0585 2972.6768 2980.2015 2992.0013 3008.7116 3034.9354 3048.3156 3069.9212 3080.7049 3083.5353 3328.5258 3519.1424 3522.4482 3557.6030
redmass: 5.6569 4.1612 3.7038 6.9572 9.7852 2.8668 2.7916 4.8668 2.5025 3.2800 1.8600 1.7785 2.1412 2.5365 3.9861 3.5901 3.7000 3.0147 2.4459 1.4284 1.5187 2.0571 3.3101 1.9579 3.5388 1.5782 3.7117 4.7746 2.6349 2.4752 1.9593 2.4347 2.4310 3.7938 3.2050 2.4917 2.9127 2.1763 1.9217 1.1761 1.5840 1.3831 1.2926 1.4199 1.3127 1.8075 1.3170 1.3399 1.2859 1.3284 1.4332 1.2226 1.1086 1.0737 1.0556 1.0920 1.7564 6.8691 9.5461 1.0372 1.0831 1.0625 1.0618 1.0846 1.0975 1.0997 1.1008 1.1029 1.0639 1.0650 1.0643 1.0776
irintensity: 4.2587 2.1089 1.8214 1.6247 0.9224 3.1142 7.1215 1.5499 35.5750 32.7926 29.3455 3.1086 17.2297 69.5828 36.5587 17.7744 12.5955 15.5387 8.7778 87.8695 97.4192 83.4379 51.2347 104.5954 5.5768 9.9274 11.0292 27.5797 18.5930 7.0587 6.7390 15.1785 14.0535 216.5637 139.7580 44.2365 7.0755 11.3118 4.0966 40.0942 31.0765 8.0390 6.9563 23.7466 64.8007 81.0028 2.7421 3.9916 1.6454 121.6351 73.7424 16.8615 12.5098 10.5005 15.8554 10.5839 127.0166 155.8127 228.9275 31.3491 23.0007 28.9368 43.1242 27.4764 6.1120 31.4056 27.9568 46.4856 101.9851 32.9491 32.0415 16.6382
temp: 298.150 k
press: 1.00000 atm
elementType: 8 8 8 8 8 7 6 6 6 6 6 6 6 1 1 1 1 1 1 1 1 1 1 1 1 1
symmnumber: 1
zpe: 540438.4 jmol-1
zpe.correction: 0.205842 hartree
zpe.thermalcorrener: 0.220884 hartree
zpe.thermalcorrenthalpy: 0.221828 hartree
zpe.thermalcorrgfe: 0.161710 hartree
zpe.sumelectzpe: -704.380256 hartree
zpe.sumelectthermal: -704.365214 hartree
zpe.sumelectthermalent: -704.364270 hartree
zpe.sumelectthermalfe: -704.424388 hartree
dipole: 1.3064 -1.2992 4.0600
dipole: 4.4585
quadrupole: -69.0999 -85.6153 -74.6164
quadrupole: -2.3283 -3.2779 0.1004
quadrupole: 7.3440 -9.1714 1.8274 -2.3283 -3.2779 0.1004
hfenergy: -704.586098 hartree
pointgroup: C01[X(C7H13N1O5)]
dipole: -0.5574153 0.6172779 1.5444156 debye
dipolederiv: -0.4976106 0.1655027 0.1403731 -0.0183085 -0.6565952 -0.0647453 -0.001358 -0.0802371 -0.5235621 -0.4432091 -0.0710491 -0.1608303 -0.1715077 -0.5824649 0.1742822 -0.1218749 0.2120079 -0.5183479 -0.7047656 -0.1365688 -0.0756326 0.1674829 -0.7277479 -0.2904545 0.1380222 -0.3877882 -0.6152224 -0.5692064 0.0615244 -0.4585604 0.0784495 -0.4345913 0.1386432 -0.4289934 0.1235376 -0.9923314 -0.7835544 -0.1753295 0.2219468 -0.0340319 -0.3500672 0.1725267 0.0583378 0.2295944 -0.802733 -0.9232178 0.3204195 0.206482 0.2846412 -0.48992 -0.00706 0.3038522 -0.1210638 -0.6301414 -0.1037779 -0.1327014 -0.0531182 0.0066971 0.393716 0.0933329 -0.1644553 0.0410518 0.3957322 -0.0713823 -0.1028145 0.0506438 -0.0403084 0.3252345 -0.1178879 0.1965944 -0.1108836 0.4552392 0.6331842 -0.1323435 -0.0152797 0.0222153 0.1361919 -0.0690257 0.017401 -0.0230997 0.2674118 1.0850674 -0.0200527 -0.1171066 -0.3997806 0.7443342 0.4941967 -0.3263522 0.6221325 0.6863335 0.0574007 0.0208988 0.0071732 -0.0072159 0.0738057 0.0259386 -0.0106261 0.0005744 0.0128652 0.0338211 -0.0384679 -0.0290761 -0.0326854 -0.066985 0.038472 -0.0484642 0.0442647 0.0719795 1.3013393 0.2067265 0.0897912 -0.0118085 0.3047248 -0.3275535 0.1697619 -0.35402 1.3669409 0.0208682 0.0170875 -0.017587 0.0119092 0.0058556 0.0355784 0.0112009 0.0137402 -0.1409471 0.0565319 0.0396808 0.062292 0.0481032 0.0224405 -0.049304 0.0419108 -0.0378597 -0.092519 -0.034535 0.0391691 0.0459621 0.0678253 0.0788841 -0.0815423 0.0776599 -0.0273811 -0.1234559 0.0302049 0.0145809 -0.0012678 -0.0674953 -0.1020375 0.0321077 -0.0501658 -0.0048157 0.0901623 -0.226306 -0.0384964 -0.0249728 -0.0079344 0.0275293 0.0148626 -0.0324752 0.027741 0.0949373 0.0919291 0.0235569 0.0821045 0.0160409 -0.0033473 -0.0613628 0.0532205 -0.047917 -0.0636723 0.1285331 -0.0099886 -0.0337198 -0.0384184 0.1891834 -0.1172946 -0.0477675 -0.0838648 0.2723889 0.0548422 0.0283194 0.0722684 0.0083187 0.0189719 -0.0638976 0.0932381 -0.1303177 -0.1280203 -0.0990115 -0.0558268 0.0014091 -0.0419341 0.0884085 -0.0137074 -0.003358 -0.0260081 0.0813453 0.0526668 0.0690703 -0.0724221 0.0632441 -0.0226428 0.0999858 -0.095177 0.1313347 -0.046206 0.4702156 -0.1411399 -0.121195 -0.0234569 0.3265289 -0.0102374 -0.0132066 0.0048509 0.3018078 0.2879761 0.0607157 0.1346238 0.1379631 0.3145727 -0.0718854 0.0588722 -0.0490923 0.2705682 0.1519963 -0.0124735 0.0656984 -0.0180044 0.3860171 0.0260318 0.1242024 0.0335186 0.3094467 unknown
polarizability: 121.3404731|-1.0836552|85.6728896|-1.2949352|2.7927563|89.9150268 unknown
InChI: InChI=1S/C7H13NO5/c1-2-3-8-6(11)4(9)5(10)7(12)13/h4-5,8-10,12H,2-3H2,1H3
charge 0 multiplicity 1
26 atoms
O  1.46677 -1.532177 -0.617559
O  0.602068 1.369491 -0.926012
O  -1.139393 -1.791047 -0.729502
O  3.275097 0.488038 1.416861
O  3.366285 1.144571 -0.819053
N  -1.622089 -0.239115 0.940506
C  0.761212 -0.756058 0.382296
C  1.180236 0.74058 0.244118
C  -3.088245 -0.280904 0.74032
C  -0.763182 -0.954855 0.155833
C  -3.560946 0.587031 -0.451429
C  -3.154778 2.071455 -0.334344
C  2.709284 0.825816 0.191214
H  1.035781 -1.108424 1.39775
H  0.830705 1.311843 1.123309
H  -3.56249 0.059469 1.679676
H  -3.371613 -1.334209 0.569271
H  -4.663431 0.494371 -0.513067
H  -3.150089 0.15711 -1.383184
H  -1.241507 0.477175 1.560324
H  -3.516335 2.517655 0.612888
H  -2.056498 2.184947 -0.384923
H  -3.583811 2.66049 -1.164612
H  0.755189 -2.027505 -1.127023
H  1.198197 1.184919 -1.700174
H  4.267684 0.482834 1.346316
