program: Gaussian 09
title: 000069833
version: EM64L-G09RevD.01
frameworkgroup: C1[X(C7H14O)]
method: RPBEPBE
basis: SDD
operation: Freq
keyword: #pfreq=noraman
keyword: PBEPBE/SDD
title: #p freq=noraman PBEPBE/SDD
converged: YES YES NO NO
title: Mulliken charges:
elementType: O C C C C C C C H H H H H H H H H H H H H H
charge: -0.452928 -0.004929 -0.477283 -0.485478 -0.425519 -0.429653 -0.409740 -0.353955 0.199926 0.197029 0.223200 0.221791 0.195097 0.205058 0.216083 0.213336 0.206666 0.222450 0.209939 0.185942 0.203917 0.339049
chargesum: 0.00000
title: Mulliken charges with hydrogens summed into heavy atoms:
elementType: O C C C C C C C
charge: -0.113879 0.194997 -0.057054 -0.068590 -0.004378 -0.009651 0.022650 0.035904
polarizability: 9.22250534e+01 -1.11381256e+00 7.30994842e+01 -7.30084590e-02 9.46717562e-01 6.39264582e+01
1716.lowfreq: -34.4836 -14.8555 -8.4698 -0.0009 -0.0005 0.0003 5.1398 79.5475 87.7094
frequency: -33.6604 79.5342 87.6874 127.0113 194.4576 285.7841 316.9540 349.2034 437.1052 583.0946 618.9922 756.6550 797.2263 808.6130 861.7614 890.4807 934.0621 947.5860 964.8512 977.8292 1009.1179 1024.0060 1059.9601 1104.0992 1111.4120 1160.8753 1176.3413 1187.9881 1207.1095 1227.0256 1231.5187 1266.4877 1275.0274 1283.8169 1294.5254 1298.0776 1309.0479 1326.2221 1348.5694 1411.5752 1461.8675 1464.4693 1471.6737 1473.4152 1483.6678 1491.3215 2927.8373 2943.8098 2972.1254 2979.0241 2980.0112 2985.4715 2992.0829 3008.9172 3036.1088 3045.7037 3051.8737 3054.6106 3076.1327 3561.1722
redmass: 1.5699 3.5154 2.0817 3.1584 2.1700 1.0871 4.7355 3.1433 1.8873 2.8211 2.6945 1.2509 1.2652 1.4546 2.9342 2.4428 1.7351 2.1537 1.3356 3.9294 2.1591 1.4166 2.7453 2.0247 2.5159 1.2896 1.4730 1.2913 1.2303 1.4188 1.2649 1.2481 1.2260 1.1867 1.2416 1.3373 1.2811 1.4673 1.6621 1.4433 1.0813 1.0836 1.0848 1.0819 1.0830 1.1002 1.0564 1.0821 1.0660 1.0924 1.0689 1.0606 1.0615 1.0660 1.0982 1.1018 1.1016 1.1028 1.1047 1.0664
irintensity: 0.1912 4.1600 7.1010 2.1447 1.0168 155.5772 9.6452 1.6486 3.6579 11.6285 0.8974 5.3821 3.3869 0.6808 1.9551 3.3075 2.9024 13.0035 1.1847 66.6675 21.3869 12.1665 0.4401 1.4119 0.4088 1.6727 1.1869 1.4395 15.6352 9.5579 4.5718 6.4566 3.0814 4.1712 3.2274 1.3187 2.4139 1.3029 3.0483 2.6117 0.8735 2.2477 7.8797 13.8528 2.9197 3.2904 58.0902 20.0886 18.3416 42.7093 30.7762 71.3746 37.7924 53.4794 38.2078 26.5280 24.0695 27.7077 128.5279 1.9398
temp: 298.150 k
press: 1.00000 atm
elementType: 8 6 6 6 6 6 6 6 1 1 1 1 1 1 1 1 1 1 1 1 1 1
symmnumber: 1
zpe: 519137.4 jmol-1
zpe.correction: 0.197729 hartree
zpe.thermalcorrener: 0.206061 hartree
zpe.thermalcorrenthalpy: 0.207005 hartree
zpe.thermalcorrgfe: 0.164360 hartree
zpe.sumelectzpe: -349.683552 hartree
zpe.sumelectthermal: -349.675220 hartree
zpe.sumelectthermalent: -349.674276 hartree
zpe.sumelectthermalfe: -349.716921 hartree
dipole: 0.4328 1.5497 0.9709
dipole: 1.8793
quadrupole: -50.7619 -50.8733 -50.3192
quadrupole: -6.5913 -3.5546 -0.0208
quadrupole: -0.1104 -0.2219 0.3323 -6.5913 -3.5546 -0.0208
hfenergy: -349.881281 hartree
pointgroup: C01 [X(C7H14O1)]
dipole: 0.171833 0.6040784 0.3901391 debye
dipolederiv: -0.8804936 -0.1626312 -0.1089612 -0.2143359 -0.2733217 0.1559864 -0.1453494 0.1599115 -0.5079869 0.0500872 0.009368 0.0218057 0.0392452 0.064524 -0.0030822 -0.0017848 -0.0240325 0.173158 -0.0344389 0.02317 0.0186743 -0.0253534 0.036054 -0.051832 0.0196293 0.026704 0.1615706 -0.0268951 -0.03528 -0.0061415 -0.0270632 -0.0057206 0.0712621 0.0114157 0.0068466 0.1441381 0.0127581 -0.0246857 -0.0175569 -0.0093242 0.0143327 -0.0048903 0.0061653 -0.0302775 0.1541331 0.0210054 0.0207704 -0.0237797 0.0108247 0.0411066 0.0047313 -0.0030842 0.0381604 0.1530768 -0.0765634 0.0403507 0.0056035 0.0785772 0.0507185 -0.0321973 0.0248709 -0.0259594 0.116913 0.7298849 0.1056095 0.0894662 0.0838111 0.272482 -0.0682104 0.0541624 -0.0648786 0.4083432 0.0360866 0.0008455 0.000063 -0.0119332 0.0222686 -0.0212197 0.0014158 -0.0097999 -0.2078033 0.0257882 -0.0269995 -0.0560396 -0.0090128 0.0561201 -0.022064 -0.0381716 -0.0891099 -0.1637026 0.0540879 -0.0252565 0.0092711 -0.0130748 -0.1588293 0.0866769 0.0040306 0.1186921 0.0228821 0.0030179 0.1064177 0.0330483 0.1128157 -0.1253067 -0.0593295 0.0498954 -0.0836831 0.0350406 0.0215838 0.0004039 -0.0610343 -0.0116948 0.0629526 -0.0216495 -0.0707981 0.0417005 -0.1670675 -0.1011656 0.0645827 0.0986603 0.0463115 0.0287651 -0.0399539 0.1478848 -0.0601635 -0.0297276 0.0022988 0.0185076 -0.0740981 0.0281271 0.0212678 0.0418404 -0.1411015 0.0662979 -0.1229114 0.0250829 -0.0155722 -0.0440391 -0.0307855 -0.0162732 -0.079497 -0.096758 -0.1270195 -0.1087346 -0.0455679 -0.082866 0.0810251 -0.066075 -0.0164338 0.075483 0.1171478 0.1125411 -0.0421182 0.0359247 -0.050454 0.0063124 -0.0593298 -0.1323816 0.0633439 0.0338312 0.0651371 0.0522415 0.05742 0.0018457 0.0331965 0.0292535 0.0657165 -0.0094517 -0.0040168 -0.0307809 -0.1605686 -0.0334484 -0.0237109 -0.0350719 -0.0297778 0.0383387 -0.0238151 -0.0372634 -0.0595161 -0.2428793 -0.0224223 -0.0591444 -0.0091219 -0.0905556 -0.1923524 0.0610252 0.0014756 0.0961121 0.008786 0.1459688 0.1147288 0.0387177 0.16935 0.1459722 -0.1231565 0.0664032 -0.1268825 0.3232169 unknown
polarizability: 92.2265343|-1.0697928|73.064153|-0.2843026|1.0944794|63.9603084 unknown
InChI: InChI=1S/C7H14O/c8-6-5-7-3-1-2-4-7/h7-8H,1-6H2
charge 0 multiplicity 1
22 atoms
O  -3.601183 -0.103441 -0.148692
C  0.190075 -0.205703 0.321248
C  1.268201 -1.23111 -0.12096
C  0.756662 1.128124 -0.238713
C  2.626259 -0.494988 0.067445
C  2.293588 1.037186 -0.007224
C  -1.232175 -0.568111 -0.155526
C  -2.302326 0.422937 0.311401
H  0.195527 -0.150495 1.432478
H  1.108604 -1.477651 -1.190123
H  1.212856 -2.178197 0.446126
H  0.31441 2.023758 0.234733
H  0.530641 1.182513 -1.323332
H  3.361042 -0.796075 -0.700653
H  3.068022 -0.744545 1.049781
H  2.568678 1.535697 0.940826
H  2.856166 1.545597 -0.810762
H  -1.51208 -1.57254 0.217919
H  -1.252852 -0.617673 -1.262347
H  -2.282996 0.507877 1.420883
H  -2.114563 1.429346 -0.120348
H  -4.323153 0.517795 0.123138
