program: Gaussian 09
title: 000004387
version: EM64L-G09RevD.01
frameworkgroup: C1[X(C9H20N4O2)]
method: RPBEPBE
basis: SDD
operation: Freq
keyword: #p
keyword: freq=noraman
keyword: PBEPBE/SDD
title: #p freq=noraman PBEPBE/SDD
converged: YES YES NO NO
title: Mulliken charges:
elementType: O O N N N N C C C C C C C C C H H H H H H H H H H H H H H H H H H H H
charge: -0.411532 -0.242292 -0.390034 -0.623469 -0.112108 -0.685593 -0.409806 -0.398736 -0.154458 -0.345540 0.152590 0.246821 -0.417165 -0.362326 -0.683123 0.228280 0.214728 0.216892 0.196925 0.259251 0.210293 0.232787 0.274614 0.310650 0.274132 0.207828 0.168346 0.180005 0.209434 0.207427 0.237075 0.195175 0.330934 0.302558 0.379436
chargesum: 0.00000
title: Mulliken charges with hydrogens summed into heavy atoms:
elementType: O O N N N N C C C C C C C C C
charge: -0.032096 -0.242292 -0.115420 -0.038687 -0.112108 -0.052102 0.033202 0.015081 0.104793 0.097541 0.152590 0.246821 -0.040991 0.027112 -0.043445
polarizability: 1.63025321e+02 1.10548601e+01 1.30934731e+02 1.94031461e+00 7.56448972e+00 1.12936555e+02
1716.lowfreq: -15.5789 -9.6957 -4.8467 -0.0007 -0.0006 -0.0005 8.5530 20.9981 37.2147
frequency: -9.0718 20.7656 37.1531 42.0319 54.8050 63.8817 83.7824 97.4179 137.1079 161.3899 191.1066 211.7794 226.2814 243.6208 253.0613 283.3425 299.2228 310.0849 336.7854 380.9652 406.9504 411.7069 431.9001 465.6831 473.4240 515.1630 545.7119 578.1044 617.1805 641.8444 662.8500 721.3079 742.9171 759.8052 800.6788 837.6628 856.1942 886.7018 905.6137 920.7842 991.7134 1043.4821 1045.9003 1049.5524 1063.7963 1069.5151 1090.2438 1112.6740 1130.9728 1137.1579 1145.3457 1175.0189 1196.6933 1226.8524 1234.2409 1254.5437 1266.7519 1271.5668 1284.6673 1290.9312 1321.9928 1343.5357 1347.7468 1357.3670 1370.1757 1378.2081 1388.9850 1451.8442 1455.6620 1458.6475 1470.9087 1472.6995 1482.4979 1487.2052 1495.4416 1603.2876 1611.1435 1652.2372 1666.7324 2854.3898 2922.7760 2938.8943 2957.0285 2971.2084 2974.2940 2983.7707 2988.3860 3020.4980 3037.6151 3044.7537 3059.4605 3066.8887 3083.6607 3496.3573 3516.2156 3525.8046 3544.0518 3638.4822 3691.7101
redmass: 4.7301 3.3612 3.2507 6.9386 4.4308 4.3623 2.2077 2.9911 2.9364 2.0621 2.6921 1.3507 1.4756 2.7601 2.8404 2.8757 2.7146 2.3131 2.5388 1.2156 1.7477 1.3917 2.0337 1.6858 1.7107 2.4383 2.3569 2.5153 2.4046 2.1603 6.9684 4.1892 1.1398 1.4079 3.0477 1.7907 2.2250 2.4037 1.3453 2.4937 2.0467 2.4442 1.7178 2.2092 2.4174 2.6363 2.0497 1.9719 1.7695 2.8576 1.6877 1.6007 2.0716 1.3493 1.2211 1.2969 1.4768 1.1940 1.1547 1.3272 1.5744 1.4678 1.3455 1.4720 1.6371 1.2377 1.8612 1.0891 1.0807 1.0944 1.0871 1.0507 2.0494 1.0561 1.0897 1.2851 1.2597 4.2865 4.0072 1.0619 1.0932 1.0709 1.0638 1.0366 1.0689 1.0618 1.0757 1.0933 1.0991 1.0972 1.0973 1.0996 1.1001 1.0449 1.0640 1.0755 1.0456 1.1001 1.1022
irintensity: 0.5996 0.0680 2.2360 1.9582 1.8647 2.0083 1.2853 0.8088 2.9975 3.1679 1.3850 33.2089 16.9941 2.6813 0.6767 4.1990 4.6101 6.3412 11.9046 39.0378 183.9172 204.3210 133.8115 279.0425 18.6354 11.2710 22.4914 80.3713 41.2522 108.3333 26.1994 22.3354 6.7826 5.2097 2.6785 1.1850 5.9898 11.2931 7.4302 2.7398 0.1633 50.2058 4.3233 220.4694 5.6776 35.8415 9.1648 8.1791 7.6427 0.5929 18.8235 5.4446 23.9173 6.3580 0.5733 7.0213 23.6586 0.9209 0.7743 26.2665 65.6789 9.0418 41.8143 13.1264 3.7427 25.6742 9.0253 34.2181 5.5712 3.1906 4.0332 5.2244 256.4292 7.8795 11.3701 135.6675 137.8594 437.1954 127.2411 103.2539 56.0996 44.1235 18.3437 46.0527 23.0317 68.0788 55.0257 4.2687 17.3154 12.7115 58.7803 71.0909 55.0571 10.1462 27.8489 6.7584 16.9710 13.3075 17.1161
temp: 298.150 k
press: 1.00000 atm
elementType: 8 8 7 7 7 7 6 6 6 6 6 6 6 6 6 1 1 1 1 1 1 1 1 1 1 1 1 1 1 1 1 1 1 1 1
symmnumber: 1
zpe: 782542.9 jmol-1
zpe.correction: 0.298055 hartree
zpe.thermalcorrener: 0.316095 hartree
zpe.thermalcorrenthalpy: 0.317039 hartree
zpe.thermalcorrgfe: 0.250207 hartree
zpe.sumelectzpe: -723.183696 hartree
zpe.sumelectthermal: -723.165656 hartree
zpe.sumelectthermalent: -723.164712 hartree
zpe.sumelectthermalfe: -723.231544 hartree
dipole: -1.1663 2.3186 0.1861
dipole: 2.6020
quadrupole: -98.7440 -84.4350 -91.5194
quadrupole: -5.7710 -13.2460 -0.1933
quadrupole: -7.1779 7.1311 0.0467 -5.7710 -13.2460 -0.1933
hfenergy: -723.4817509 hartree
pointgroup: C01 [X(C9H20N4O2)]
dipole: 0.4333032 0.9256242 0.0589442 debye
polarizability: 163.6357158|-10.3753498|132.1348827|0.1408422|-4.5616374|111.126008 unknown
InChI: InChI=1S/C9H20N4O2/c1-2-5-12-9(11)13-6-3-4-7(10)8(14)15/h7,13-14H,2-6,10-11H2,1H3
charge 0 multiplicity 1
35 atoms
O  -4.537239 -0.156505 1.600872
O  -4.61072 0.993846 -0.414186
N  0.976655 1.29584 -0.02236
N  -3.560366 -1.196446 -1.753384
N  3.062393 0.276623 0.406548
N  2.908657 2.57735 -0.373795
C  -1.993709 -1.133102 0.277493
C  -1.214924 0.138673 -0.116723
C  -3.457591 -1.197393 -0.294356
C  0.257557 0.062016 0.331185
C  -4.25731 -0.014139 0.237794
C  2.380042 1.332511 0.026489
C  4.535029 0.28432 0.30334
C  5.071366 -1.163123 0.367659
C  4.616203 -2.011298 -0.836858
H  -2.040102 -1.231913 1.379171
H  -1.461004 -2.02768 -0.104121
H  -1.255722 0.282867 -1.213778
H  -1.700478 1.027302 0.33987
H  -3.921572 -2.111706 0.126917
H  0.320161 -0.141159 1.423171
H  0.777622 -0.777872 -0.162006
H  0.493271 2.175044 0.176452
H  -3.727681 -0.280829 -2.176527
H  -2.897568 -1.79418 -2.247205
H  4.982654 0.863359 1.144204
H  4.89943 0.755716 -0.644775
H  6.17879 -1.137449 0.421343
H  4.704775 -1.621732 1.305714
H  4.957082 -3.059314 -0.747632
H  3.513522 -2.005309 -0.899305
H  5.015473 -1.602867 -1.785673
H  3.906919 2.740305 -0.279254
H  2.385545 3.1780 -1.007888
H  -5.035859 0.644243 1.919104
