program: Gaussian 09
title: 000069817
version: EM64L-G09RevD.01
frameworkgroup: C1[X(C6H10O)]
method: RPBEPBE
basis: SDD
operation: Freq
keyword: #pfreq=noraman
keyword: PBEPBE/SDD
title: #p freq=noraman PBEPBE/SDD
converged: NO NO NO NO
title: Mulliken charges:
elementType: O C C C C C C H H H H H H H H H H
charge: -0.193735 -0.363737 -0.444087 -0.436866 -0.030996 -0.063603 -0.591235 0.231244 0.218828 0.193820 0.201002 0.228559 0.232780 0.215804 0.168994 0.216608 0.216621
chargesum: 0.00000
title: Mulliken charges with hydrogens summed into heavy atoms:
elementType: O C C C C C C
charge: -0.193735 0.086335 -0.049264 0.024473 0.184808 0.105390 -0.158006
polarizability: 8.58244342e+01 3.62191887e+00 6.04683884e+01 7.86047242e+00 -2.25463193e+00 5.19320297e+01
1716.lowfreq: -1.1020 -0.0005 0.0002 0.0006 13.2122 42.6222 58.0297 87.8580 97.4462
frequency: 56.0031 87.8474 97.1046 145.2380 176.1029 256.4094 349.2866 425.4346 618.5321 664.6725 693.6868 765.8253 885.7757 895.4286 936.0856 946.8430 1003.2174 1024.6328 1048.0639 1078.7628 1126.1992 1185.7932 1240.4281 1256.3299 1279.1943 1293.4833 1315.4015 1352.3430 1378.7586 1425.3398 1428.8387 1460.4904 1475.5492 1639.8744 1661.8133 2838.1173 2938.7629 2942.9996 2976.8610 2994.7796 3007.7040 3057.3558 3066.8605 3083.9458 3189.0336
redmass: 2.9259 2.6441 2.6976 2.7657 1.7531 3.5251 2.8118 2.1389 1.7584 1.1540 3.1727 1.2012 3.1233 1.2745 1.7436 1.3456 1.1243 1.5465 3.1985 2.4866 1.6579 1.6602 1.3564 1.2326 1.0814 1.2300 1.4660 1.5979 1.2343 1.1030 1.1765 1.0932 1.0942 7.3070 4.7173 1.0839 1.0620 1.0619 1.0955 1.0623 1.0950 1.1004 1.0816 1.0746 1.1141
irintensity: 1.5257 3.2694 1.6034 4.6354 1.4437 3.1059 1.3607 3.3507 21.0013 13.7284 2.7895 2.2131 13.4116 2.1045 3.4843 81.3914 13.9558 5.6694 2.3321 3.4441 2.7718 4.8901 19.0381 0.0432 0.3508 3.1889 8.1330 8.7064 7.8066 30.8004 4.0909 3.3349 19.2789 120.6476 17.0808 161.0230 28.3046 43.7579 10.7574 17.6636 14.2682 23.4027 51.4403 5.2808 30.3992
temp: 298.150 k
press: 1.00000 atm
elementType: 8 6 6 6 6 6 6 1 1 1 1 1 1 1 1 1 1
symmnumber: 1
zpe: 375455.2 jmol-1
zpe.correction: 0.143003 hartree
zpe.thermalcorrener: 0.151495 hartree
zpe.thermalcorrenthalpy: 0.152439 hartree
zpe.thermalcorrgfe: 0.109169 hartree
zpe.sumelectzpe: -309.260283 hartree
zpe.sumelectthermal: -309.251792 hartree
zpe.sumelectthermalent: -309.250847 hartree
zpe.sumelectthermalfe: -309.294118 hartree
dipole: -0.7632 2.8744 0.0692
dipole: 2.9748
quadrupole: -48.6750 -45.2444 -41.6775
quadrupole: 9.0944 0.4495 -1.5275
quadrupole: -3.4760 -0.0454 3.5215 9.0944 0.4495 -1.5275
hfenergy: -309.4032865 hartree
pointgroup: C01 [X(C6H10O1)]
dipole: -0.3120245 -1.125718 0.0720549 debye
dipolederiv: -0.587904 -0.0966355 0.0005296 -0.2380495 -0.7718313 0.0550064 0.0127175 0.062167 -0.3001061 0.0547106 0.0023278 -0.0084852 0.0868241 0.0097875 -0.013948 -0.0340282 0.0129811 0.1527624 -0.0899664 0.0625237 0.0009473 0.073206 0.1056231 0.0555389 0.0170193 0.0245124 0.1611886 -0.4018341 -0.1797008 -0.0081281 -0.3509629 -0.1224623 0.0315334 -0.001552 0.0243793 0.1736447 0.1454317 -0.16775 -0.1028065 -0.2989097 0.0064745 -0.1237304 -0.0487532 -0.1471392 0.0588295 1.0151173 0.1648493 0.0351992 0.2108591 0.9422421 -0.1188456 0.0448378 -0.1109195 0.0757285 -0.2790863 -0.1264838 -0.0283238 -0.1033288 -0.1809293 -0.2129467 -0.0025461 -0.2256241 -0.0844214 0.0505776 0.004195 0.0002447 0.0041263 -0.0212767 -0.0979074 -0.0117975 -0.1038411 -0.0382271 0.0622773 -0.0128385 0.0075773 0.0059352 0.0103115 0.0937372 0.019779 0.1033541 -0.0782347 0.0214987 0.0510461 0.0379521 0.0466194 -0.0585972 -0.1271762 -0.0062636 -0.1363769 -0.0503976 0.023659 -0.0145792 0.0275046 -0.0080917 -0.0021036 0.088407 0.0071539 0.1383805 -0.0986429 0.0500143 -0.0073805 0.0093892 0.0736747 -0.0006275 -0.0989192 0.0146515 -0.1370327 -0.0034346 0.0474105 -0.0211931 0.0033153 0.0623218 0.0531528 0.0918304 -0.0178742 0.1215702 -0.055418 0.0667757 0.0183686 0.049507 0.0683749 0.032061 0.121722 0.012213 0.134939 -0.0598196 -0.2598555 0.139785 -0.0382914 0.1806133 -0.1286324 0.0437401 -0.0526476 0.0418028 0.0841225 -0.0270025 0.135337 0.0016555 0.1613948 0.0595233 0.0667539 0.0062495 0.0713686 0.0995019 0.1081763 0.048129 0.0122132 0.0253931 0.0672846 0.1452042 0.0408409 0.1254786 -0.0370758 unknown
polarizability: 85.6094224|-4.5841694|60.1180925|-7.8095034|-2.8317841|52.4973374 unknown
InChI: InChI=1S/C6H10O/c1-2-3-4-5-6-7/h2,6H,1,3-5H2
charge 0 multiplicity 1
17 atoms
O  2.903564 1.029568 -0.04787
C  0.149267 0.088965 -0.087096
C  -1.200986 -0.67198 -0.146905
C  1.339034 -0.867752 0.110112
C  -2.373855 0.255897 -0.388192
C  2.702768 -0.198413 0.11907
C  -3.443602 0.39795 0.433285
H  0.127039 0.829617 0.73441
H  0.29907 0.670079 -1.017845
H  -1.147862 -1.419549 -0.969048
H  -1.35926 -1.238997 0.792728
H  1.363213 -1.648009 -0.684548
H  1.245321 -1.440206 1.060126
H  -2.3218 0.862377 -1.308173
H  3.564393 -0.902203 0.279297
H  -4.258217 1.094618 0.203472
H  -3.535287 -0.181561 1.361877
