program: Gaussian 09
title: 000069853
version: EM64L-G09RevD.01
frameworkgroup: C1[X(C10H15N)]
method: RPBEPBE
basis: SDD
operation: Freq
keyword: #pfreq=noraman
keyword: PBEPBE/SDD
title: #p freq=noraman PBEPBE/SDD
converged: YES YES NO NO
title: Mulliken charges:
elementType: N C C C C C C C C C C H H H H H H H H H H H H H H H
charge: -0.236101 0.139224 0.353423 0.365280 -0.413992 -0.422647 -0.810892 -0.810313 -0.245295 -0.630118 -0.628186 0.227820 0.225733 0.238788 0.219823 0.221697 0.223300 0.228166 0.228373 0.221496 0.233298 0.214997 0.204041 0.210273 0.233891 0.207918
chargesum: 0.00000
title: Mulliken charges with hydrogens summed into heavy atoms:
elementType: N C C C C C C C C C C
charge: -0.236101 0.139224 0.353423 0.365280 -0.186173 -0.196913 -0.130584 -0.130474 -0.023798 0.022218 0.023897
polarizability: 1.45282073e+02 -7.52969487e-02 1.28138556e+02 -1.67077917e-01 -1.50690755e+00 6.99822110e+01
1716.lowfreq: -15.6295 -10.9726 -0.0005 -0.0001 0.0004 4.4000 55.7990 89.7466 105.6010
frequency: 55.5003 89.7324 105.5900 142.9710 158.3593 188.6543 191.8191 221.2108 232.4886 284.0207 286.7866 332.6701 362.8895 478.2237 482.0348 509.7292 541.6370 567.9283 610.6290 757.5011 768.7393 774.3970 896.7259 916.3402 953.7357 965.6835 979.0231 1024.4179 1042.1280 1044.4260 1059.4217 1087.6871 1094.9017 1129.7280 1144.9509 1174.2065 1223.4564 1259.2659 1261.5905 1347.0617 1359.1620 1388.9308 1394.4966 1423.2657 1426.5034 1447.6097 1451.1880 1455.3819 1456.1925 1466.4856 1471.4038 1479.0107 1488.1598 1495.2070 1517.0494 1585.8951 1601.8644 2893.1760 2901.9738 2962.9818 2967.8518 2969.0809 2974.3295 3045.8415 3052.0414 3081.5092 3083.3154 3084.8555 3096.7729 3111.8341 3119.4314 3151.6429
redmass: 1.7536 2.9979 2.0148 1.0884 1.1688 1.7906 1.0598 2.7028 1.9363 2.9554 3.0159 2.5084 3.1692 3.6149 3.4540 3.0469 5.2161 3.3031 3.9779 4.3459 5.2116 1.2175 1.3101 2.5697 3.0153 1.3319 1.6009 1.7618 1.5554 1.5222 1.3969 1.4558 1.4477 1.3507 1.9483 1.1638 4.4083 3.8202 1.8390 2.7991 6.4796 1.2656 1.2621 1.1309 1.5643 1.2866 1.4304 1.1878 1.0907 1.1465 1.1105 1.1547 1.1831 1.1234 1.2527 7.1716 5.5789 1.0458 1.0489 1.0861 1.0435 1.0875 1.0402 1.0926 1.0958 1.0993 1.0944 1.0997 1.0930 1.0855 1.0916 1.0990
irintensity: 3.5672 0.1128 1.8653 1.5051 2.7696 6.6423 0.0681 0.1422 1.0838 4.8627 3.7578 1.1519 7.5895 0.3485 1.5238 3.0278 0.5443 3.3935 0.4830 2.1524 0.2210 56.7404 0.8001 2.4888 33.7066 0.2037 5.3956 4.3242 11.7207 0.1588 7.7311 59.9726 12.0722 4.6617 26.1244 1.2957 25.6170 2.2036 6.5941 22.0517 0.6399 15.7915 12.0864 5.1411 33.6119 5.0052 3.9266 10.0459 11.0169 8.2372 32.6468 36.7411 36.3092 19.2791 30.9352 2.0870 11.2153 75.8342 211.3952 76.4885 82.2823 18.2446 43.1598 25.1806 21.9437 22.8369 18.6171 22.0333 22.8049 1.4877 33.7778 35.3760
temp: 298.150 k
press: 1.00000 atm
elementType: 7 6 6 6 6 6 6 6 6 6 6 1 1 1 1 1 1 1 1 1 1 1 1 1 1 1
symmnumber: 1
zpe: 587083.6 jmol-1
zpe.correction: 0.223608 hartree
zpe.thermalcorrener: 0.235934 hartree
zpe.thermalcorrenthalpy: 0.236878 hartree
zpe.thermalcorrgfe: 0.185840 hartree
zpe.sumelectzpe: -443.957186 hartree
zpe.sumelectthermal: -443.944860 hartree
zpe.sumelectthermalent: -443.943916 hartree
zpe.sumelectthermalfe: -443.994954 hartree
dipole: -1.3569 -0.0804 0.1248
dipole: 1.3650
quadrupole: -63.0959 -63.0244 -69.8946
quadrupole: 0.1597 -0.0596 0.6236
quadrupole: 2.2424 2.3139 -4.5563 0.1597 -0.0596 0.6236
hfenergy: -444.180794 hartree
pointgroup: C01 [X(C10H15N1)]
dipole: 0.5328724 -0.0583812 -0.0322119 debye
dipolederiv: -1.0858872 0.0392216 0.0120922 -0.0486463 -0.4938637 0.0383646 -0.0017834 0.060228 -0.5082461 1.1346742 0.0166691 0.0148058 0.0179727 -0.0589575 0.0771956 0.0017167 0.0481668 -0.1212862 -0.1526694 0.0995531 -0.0188065 0.2666935 0.200564 -0.049095 -0.1963248 -0.0829033 -0.0368137 -0.1351352 -0.107237 0.010203 -0.2777713 0.181143 -0.0438996 0.1934254 -0.0571864 -0.0403768 0.0384 -0.0869618 0.0164711 -0.0428717 -0.007818 -0.0337926 -0.0010587 -0.0262382 -0.1804411 0.0135645 0.0755686 -0.0052557 0.0532043 -0.0021726 -0.0336948 0.0226164 -0.0271392 -0.180754 -0.0123209 -0.0814658 -0.0090434 -0.0926919 -0.0673414 0.0203808 -0.0155877 0.0644493 0.0675071 -0.0071983 0.1082271 -0.0027412 0.0924266 -0.0438867 0.0127122 -0.0108518 0.0394186 0.0688268 -0.0069158 0.004961 0.0004826 -0.0102671 -0.0633058 -0.017961 0.0001956 -0.0281991 -0.1610487 0.3333736 -0.1357642 0.2200501 -0.3886864 0.3927157 -0.0577539 0.3499989 -0.0455668 0.300318 0.3965599 0.0731176 -0.2662116 0.3355546 0.3195177 0.0137897 -0.3810353 0.0431063 0.3415601 0.0232987 0.0802166 -0.0182147 0.1187726 -0.0890153 0.038091 -0.0000756 0.0425522 0.1424865 0.0286347 -0.0745805 0.0135176 -0.1160099 -0.1007605 0.0360098 -0.0034539 0.0383996 0.143582 -0.0441949 -0.0762884 -0.0936445 -0.0157747 0.0924487 0.0231104 -0.0957875 -0.0350492 0.0299344 0.0711906 -0.0768734 0.07923 -0.0464632 0.0224201 0.0178085 0.0926825 0.0850991 -0.1231025 -0.0169567 0.1599924 0.0462533 0.0605574 -0.0798614 -0.0328527 0.0330214 -0.0602798 0.0903194 -0.017903 -0.1677854 -0.0331657 -0.0613558 -0.0765856 -0.023083 -0.0246225 -0.0478869 0.0964878 -0.0514071 0.0645051 0.1048125 0.0139531 0.0615335 0.028508 0.1111378 -0.0227248 0.0077558 0.0542295 0.0876661 -0.0922296 0.0489243 0.0310118 0.0119155 -0.0993358 0.0739846 -0.1041215 -0.1556809 -0.0049029 -0.0025052 -0.0055385 0.0801632 0.0122349 -0.0031013 0.0187598 0.1582175 0.0383307 -0.0108475 0.1374903 0.0227243 0.0741288 0.0520952 0.0828675 0.0314527 -0.0514707 -0.1896392 -0.0772723 -0.1352408 -0.1525437 -0.0448068 -0.0605262 -0.1040416 -0.0063816 0.0597972 -0.0289752 0.1227926 -0.0553211 0.2233954 -0.2072145 0.0394194 0.0092701 -0.0631101 0.0046696 -0.133454 -0.1472834 0.051667 -0.1944962 -0.0665649 -0.0074935 -0.0431597 -0.0641366 0.0332987 0.0255405 0.060069 -0.1160611 0.0297234 0.0651158 0.0849895 -0.0838737 0.0600021 -0.0178075 -0.119459 0.0547025 0.1413656 0.1692146 -0.1186076 -0.1464727 0.167161 -0.038817 -0.019292 unknown
polarizability: 145.2634492|-0.3858623|125.9460914|0.6549428|-11.2154609|72.1932999 unknown
InChI: InChI=1S/C10H15N/c1-8-6-5-7-9(2)10(8)11(3)4/h5-7H,1-4H3
charge 0 multiplicity 1
26 atoms
N  1.66307 0.093314 0.05779
C  0.232776 0.031882 0.017276
C  -0.510647 1.240715 -0.195276
C  -0.462417 -1.209125 0.198806
C  -1.925134 1.186969 -0.220186
C  -1.878936 -1.213214 0.196339
C  0.195864 2.576046 -0.344399
C  0.285592 -2.52598 0.331225
C  -2.613955 -0.027663 -0.015996
C  2.426147 -0.466736 1.173691
C  2.437873 0.446643 -1.134934
H  -2.489036 2.115558 -0.373295
H  -2.407051 -2.165044 0.334119
H  1.099709 2.607286 0.290038
H  0.527128 2.763595 -1.384997
H  -0.472025 3.407823 -0.060398
H  -0.38879 -3.37574 0.127787
H  1.129335 -2.575598 -0.380851
H  0.708672 -2.676012 1.342972
H  -3.70935 -0.050522 -0.024389
H  1.774962 -0.576122 2.05673
H  3.251515 0.223899 1.44831
H  2.885602 -1.458775 0.955566
H  3.214143 1.208278 -0.907494
H  1.772302 0.856461 -1.911169
H  2.956451 -0.438036 -1.572566
