program: Gaussian 09
title: 000069821
version: EM64L-G09RevD.01
frameworkgroup: C1[X(C12H22)]
method: RPBEPBE
basis: SDD
operation: Freq
keyword: #p
keyword: freq=noraman
keyword: PBEPBE/SDD
title: #p freq=noraman PBEPBE/SDD
converged: YES YES NO NO
title: Mulliken charges:
elementType: C C C C C C C C C C C C H H H H H H H H H H H H H H H H H H H H H H
charge: -0.382569 -0.381147 -0.383352 -0.372811 -0.365195 -0.353179 -0.380502 -0.356715 -0.495146 -0.696325 0.201063 -0.515810 0.192911 0.193308 0.192347 0.192595 0.195416 0.195969 0.189524 0.189493 0.192106 0.192603 0.187860 0.187885 0.212971 0.213109 0.194760 0.194839 0.227941 0.228226 0.209700 0.215124 0.209739 0.273265
chargesum: 0.00000
title: Mulliken charges with hydrogens summed into heavy atoms:
elementType: C C C C C C C C C C C C
charge: 0.003650 0.003795 0.008033 0.006206 0.019513 0.022566 0.045578 0.032884 -0.038979 -0.061762 0.201063 -0.242546
polarizability: 1.80263545e+02 1.08390300e+01 1.09791611e+02 2.19804152e-01 6.05298437e-02 9.73716848e+01
1716.lowfreq: -2.4451 -0.0008 0.0007 0.0010 9.6746 26.1964 35.9437 44.9739 55.6387
frequency: 30.5461 36.0475 52.7568 70.3196 89.9981 90.1786 114.0761 128.0663 150.9207 151.0746 157.2443 198.1109 226.2455 241.4130 329.6717 343.4344 366.2458 447.8714 480.3403 524.2353 633.0755 637.7817 721.8435 723.8471 730.6932 749.4257 786.5079 840.3696 887.3388 902.6116 927.7899 966.1315 988.3089 997.8699 1021.2176 1024.9914 1054.1476 1061.0003 1074.7246 1080.8133 1082.8021 1111.2411 1121.5883 1184.0471 1207.5219 1210.6553 1240.6731 1242.1237 1269.4406 1270.6535 1280.0543 1287.4109 1290.1232 1298.8791 1299.6980 1300.5327 1324.9441 1343.0773 1353.1138 1356.0763 1357.4761 1389.3315 1457.5205 1461.5915 1462.0852 1465.1285 1466.2496 1471.2329 1476.5525 1476.9038 1482.5634 1487.3973 1490.2955 2138.8694 2950.7569 2950.8568 2953.0133 2953.7839 2958.8299 2964.9156 2968.8404 2969.4148 2972.3116 2984.0596 2988.4027 2989.4193 2994.6789 3004.1401 3013.2713 3018.6378 3031.1000 3041.8078 3058.0515 3068.9126 3070.9356 3427.7882
redmass: 3.5613 4.1415 2.3065 2.0964 2.1803 3.1088 2.0658 1.9688 3.2806 2.2027 2.0283 4.3280 1.1327 3.4443 3.0151 3.2204 3.9031 3.1917 3.2150 4.0575 1.2293 1.2243 1.0589 1.0681 1.0928 1.1397 1.1957 1.2394 1.9028 1.2462 5.0874 1.2075 4.9510 3.9281 1.1105 3.7321 3.0770 2.9819 2.5294 2.1010 2.3129 1.3269 2.7620 1.8293 1.2608 1.5039 1.2985 1.3392 1.2290 1.3052 1.0288 1.0889 1.1008 1.0988 1.3129 1.1267 1.3844 1.4576 1.6146 1.6444 1.6459 1.2174 1.0824 1.0728 1.0720 1.0617 1.0768 1.0799 1.0426 1.0803 1.0872 1.0936 1.0969 6.0540 1.0587 1.0586 1.0589 1.0593 1.0593 1.0589 1.0584 1.0586 1.0366 1.0962 1.0976 1.0593 1.0997 1.1019 1.1006 1.1040 1.1049 1.1047 1.1047 1.1007 1.0993 1.1582
irintensity: 0.0689 0.0332 0.0568 0.0031 0.0154 0.0249 0.0000 0.0083 0.1743 0.0470 0.0010 0.0091 0.0003 0.3823 6.7630 1.0594 0.7388 1.6036 0.0582 5.0775 77.4371 78.9185 18.1977 0.8140 5.6552 0.0333 1.3772 0.2559 5.0016 0.6911 0.6370 0.1810 0.2563 0.6728 0.2037 0.4669 0.7917 3.5869 0.0198 0.0219 0.6642 0.0246 12.8208 0.1551 15.5464 0.0130 0.0557 0.0885 0.3584 0.7921 0.0060 0.4955 0.1421 0.0144 0.8107 0.2426 1.4599 1.6380 0.2107 0.2242 0.6480 11.3089 2.4634 0.0213 0.4492 0.0831 0.3274 0.8111 12.2447 1.6761 3.0533 2.0337 36.5697 15.7418 0.0317 0.2314 3.4990 1.8843 0.2718 55.2783 9.9807 190.3793 36.5575 0.0860 0.5233 58.8303 0.9269 1.1766 6.0544 0.4676 0.5443 150.3661 121.8438 100.6639 55.4609 67.9891
temp: 298.150 k
press: 1.00000 atm
elementType: 6 6 6 6 6 6 6 6 6 6 6 6 1 1 1 1 1 1 1 1 1 1 1 1 1 1 1 1 1 1 1 1 1 1
symmnumber: 1
zpe: 804674.5 jmol-1
zpe.correction: 0.306484 hartree
zpe.thermalcorrener: 0.322537 hartree
zpe.thermalcorrenthalpy: 0.323481 hartree
zpe.thermalcorrgfe: 0.261461 hartree
zpe.sumelectzpe: -469.426522 hartree
zpe.sumelectthermal: -469.410469 hartree
zpe.sumelectthermalent: -469.409525 hartree
zpe.sumelectthermalfe: -469.471545 hartree
dipole: 1.1170 0.4037 0.0065
dipole: 1.1877
quadrupole: -86.8955 -77.3806 -76.8396
quadrupole: 0.5189 0.0025 0.0521
quadrupole: -6.5235 2.9913 3.5323 0.5189 0.0025 0.0521
hfenergy: -469.7330062 hartree
pointgroup: C01 [X(C12H22)]
dipole: 0.4403743 -0.1552029 -0.0186326 debye
polarizability: 180.3834978|-10.3236575|109.552542|-1.5936597|1.1841047|97.4908007 unknown
InChI: InChI=1S/C12H22/c1-3-5-7-9-11-12-10-8-6-4-2/h1H,4-12H2,2H3
charge 0 multiplicity 1
34 atoms
C  0.616559 -0.522339 -0.044294
C  1.883702 0.360192 0.015793
C  -0.697045 0.289355 0.018543
C  3.198179 -0.450497 -0.041554
C  -1.963513 -0.594166 -0.038984
C  4.46532 0.431968 0.020326
C  -3.272286 0.221956 0.037598
C  5.780247 -0.378766 -0.039016
C  -4.533493 -0.685557 -0.022793
C  7.040582 0.51108 0.0247
C  -5.799659 0.064581 0.061088
C  -6.854273 0.701189 0.134089
H  0.637703 -1.250326 0.79368
H  0.632563 -1.123092 -0.977824
H  1.866089 0.963404 0.947752
H  1.864549 1.086341 -0.823793
H  -0.711602 0.890405 0.951639
H  -0.719101 1.016673 -0.819589
H  3.216838 -1.053021 -0.974028
H  3.217143 -1.17735 0.797564
H  -1.936773 -1.326597 0.795066
H  -1.953107 -1.189066 -0.976443
H  4.447468 1.159793 -0.817956
H  4.449072 1.033659 0.953373
H  -3.295566 0.809981 0.97556
H  -3.312434 0.95134 -0.794511
H  5.795585 -0.978545 -0.972109
H  5.797088 -1.1067 0.797834
H  -4.491185 -1.423029 0.803951
H  -4.51684 -1.270648 -0.964381
H  7.060352 1.229694 -0.816428
H  7.966509 -0.091244 -0.023349
H  7.065466 1.095337 0.964076
H  -7.773339 1.253994 0.19772
