program: Gaussian 09
title: 000069822
version: EM64L-G09RevD.01
frameworkgroup: C1[X(C11H24O2)]
method: RPBEPBE
basis: SDD
operation: Freq
keyword: #pfreq=noraman
keyword: PBEPBE/SDD
title: #p freq=noraman PBEPBE/SDD
converged: YES YES NO NO
title: Mulliken charges:
elementType: O O C C C C C C C C C C C H H H H H H H H H H H H H H H H H H H H H H H H
charge: -0.452471 -0.452464 -0.384640 -0.382359 -0.382388 -0.375816 -0.375771 -0.377388 -0.377401 -0.365503 -0.365491 -0.342337 -0.342330 0.194452 0.194514 0.192206 0.192187 0.192256 0.192161 0.195110 0.195089 0.195135 0.195045 0.188934 0.188884 0.188910 0.188893 0.213753 0.213788 0.213760 0.213765 0.186830 0.186820 0.186829 0.186809 0.340111 0.340118
chargesum: 0.00000
title: Mulliken charges with hydrogens summed into heavy atoms:
elementType: O O C C C C C C C C C C C
charge: -0.112361 -0.112346 0.004325 0.002033 0.002028 0.014383 0.014410 0.000430 0.000402 0.062038 0.062035 0.031314 0.031308
polarizability: 1.75540565e+02 -7.78262600e-04 1.10952290e+02 -7.37448203e-04 -5.86714248e-03 1.00869666e+02
1716.lowfreq: -3.7529 -0.0008 0.0008 0.0012 8.8906 22.8106 29.1010 46.4427 47.0605
frequency: 25.0912 29.1011 46.4337 58.8274 80.3902 80.8477 93.7766 114.1387 130.4253 142.2288 150.0631 158.2811 161.6068 168.7496 236.2257 274.2685 274.6790 321.7443 331.7316 425.4572 443.0299 496.7992 508.7326 724.7168 731.0818 745.2612 766.0158 792.1108 827.7038 874.3706 929.2081 958.0840 958.9186 977.4369 984.1066 990.6604 1004.4673 1029.0563 1034.1143 1041.6109 1062.9518 1077.9247 1081.8015 1083.3529 1091.1644 1148.7013 1150.8913 1189.5130 1193.9886 1208.3123 1221.7550 1229.0620 1250.2543 1251.2120 1274.3434 1275.8140 1279.5047 1282.3211 1290.9046 1293.4110 1300.1091 1301.8189 1302.2624 1327.8147 1348.1481 1356.6158 1359.8151 1361.1353 1413.7107 1413.7826 1462.0509 1462.4157 1465.9291 1468.2353 1469.5473 1471.7221 1476.8845 1481.7889 1486.5059 1491.4429 1492.6270 2925.3822 2925.4114 2950.7781 2950.8438 2952.7107 2953.5170 2956.7116 2962.9699 2967.3851 2972.4181 2972.4489 2984.2041 2988.1217 2992.5790 2992.7572 2993.1936 3000.8896 3015.5494 3030.0408 3041.6477 3059.6368 3060.1218 3563.2740 3563.3186
redmass: 4.5105 5.0107 3.1816 2.0028 4.2927 2.2606 2.3358 1.9157 2.3865 1.9464 4.3341 2.1769 2.0129 4.8797 3.7410 1.0865 1.0867 4.8531 3.4198 3.1692 4.1873 3.0213 3.3474 1.0619 1.0773 1.0937 1.1080 1.1345 1.1805 1.2173 1.2189 8.0321 6.8262 4.5356 1.1736 3.5572 3.8607 1.0809 2.6258 4.1130 2.5875 2.3189 2.0989 2.2074 3.8218 1.4178 1.3293 1.1626 1.6426 1.2933 1.4442 1.3289 1.3362 1.3037 1.2335 1.2937 1.0377 1.0725 1.0775 1.1496 1.0996 1.3149 1.1211 1.3698 1.4565 1.7065 1.5671 1.6516 1.4407 1.4412 1.0741 1.0695 1.0738 1.0704 1.0722 1.0890 1.0904 1.0911 1.0946 1.0966 1.0985 1.0544 1.0544 1.0588 1.0585 1.0587 1.0589 1.0596 1.0593 1.0585 1.1065 1.1065 1.0961 1.0974 1.0591 1.0591 1.0995 1.1023 1.1045 1.1053 1.1049 1.1048 1.1047 1.0664 1.0664
irintensity: 0.1008 0.0085 0.0001 0.0001 2.8922 10.9091 3.9569 0.0000 0.0000 6.8786 0.2079 0.0793 0.0000 0.0072 8.9656 4.3792 310.3164 3.5917 0.8166 16.4971 1.7995 1.4642 14.5993 14.0951 0.0000 8.3980 0.0000 2.4298 0.0000 0.0001 0.0000 24.4954 41.4115 90.0064 0.1213 1.6565 19.7182 0.0001 31.9953 3.5510 3.3388 0.6630 0.5431 0.0819 2.4237 1.6190 0.0001 5.1244 0.0721 33.9796 0.0002 32.6055 0.2722 15.8558 0.0010 18.9546 0.0001 3.7273 0.0001 0.4176 0.5793 2.3839 0.0016 5.4604 0.2930 0.0177 0.6941 0.1514 10.5719 1.4777 0.0006 0.0112 0.1117 0.0349 0.8798 0.5941 0.8648 2.5423 1.9159 2.4712 31.5842 4.8648 118.9597 0.1600 2.1727 0.1823 17.7775 4.0185 0.0274 225.7599 10.2751 96.1526 1.2977 0.0007 25.5446 70.5196 3.7323 0.0001 3.5877 0.0017 133.2157 13.8324 237.7659 1.8418 2.3460
temp: 298.150 k
press: 1.00000 atm
elementType: 8 8 6 6 6 6 6 6 6 6 6 6 6 1 1 1 1 1 1 1 1 1 1 1 1 1 1 1 1 1 1 1 1 1 1 1 1
symmnumber: 1
zpe: 876557.7 jmol-1
zpe.correction: 0.333863 hartree
zpe.thermalcorrener: 0.351645 hartree
zpe.thermalcorrenthalpy: 0.352589 hartree
zpe.thermalcorrgfe: 0.285789 hartree
zpe.sumelectzpe: -582.880573 hartree
zpe.sumelectthermal: -582.862791 hartree
zpe.sumelectthermalent: -582.861847 hartree
zpe.sumelectthermalfe: -582.928647 hartree
dipole: 0.0007 3.6855 -0.0061
dipole: 3.6855
quadrupole: -78.5781 -86.7094 -82.7808
quadrupole: -0.0025 0.0414 -0.0029
quadrupole: 4.1113 -4.0200 -0.0914 -0.0025 0.0414 -0.0029
hfenergy: -583.2144364 hartree
pointgroup: C01 [X(C11H24O2)]
dipole: -0.0001749 -1.4498469 -0.0212756 debye
polarizability: 175.5405603|0.0038644|110.9504291|0.0176852|0.1370982|100.8715308 unknown
InChI: InChI=1S/C11H24O2/c12-10-8-6-4-2-1-3-5-7-9-11-13/h12-13H,1-11H2
charge 0 multiplicity 1
37 atoms
O  7.57254 0.481296 0.012786
O  -7.571294 0.480474 0.007248
C  0.000501 0.37479 0.009926
C  1.291809 -0.473974 -0.001718
C  -1.290493 -0.474396 -0.000673
C  2.581785 0.376403 0.009054
C  -2.580659 0.375695 0.009975
C  3.873399 -0.47231 -0.001525
C  -3.87215 -0.473074 -0.001995
C  5.156609 0.388791 0.010513
C  -5.155453 0.387865 0.00766
C  6.433741 -0.454835 -0.001395
C  -6.43259 -0.455717 -0.003549
H  -0.000027 1.052743 -0.869201
H  0.00085 1.029871 0.906233
H  1.291418 -1.128505 -0.898627
H  1.29224 -1.15224 0.877405
H  -1.290342 -1.15194 0.878967
H  -1.290405 -1.129677 -0.897054
H  2.58232 1.053498 -0.870436
H  2.582051 1.031661 0.904976
H  -2.581551 1.030225 0.906433
H  -2.580713 1.053711 -0.868856
H  3.870328 -1.149872 0.878307
H  3.871178 -1.126247 -0.89906
H  -3.870436 -1.150167 0.878234
H  -3.868516 -1.127694 -0.899064
H  5.170167 1.06066 -0.869551
H  5.170138 1.035607 0.909175
H  -5.168459 1.058192 -0.873615
H  -5.169594 1.036429 0.905075
H  6.458575 -1.119658 0.890481
H  6.459262 -1.093251 -0.912343
H  -6.4584 -1.118451 0.889845
H  -6.457192 -1.096291 -0.913009
H  8.420255 -0.030857 0.004219
H  -8.419092 -0.031559 -0.000441
