program: Gaussian 09
title: 000069825
version: EM64L-G09RevD.01
frameworkgroup: C1[X(C15H28)]
method: RPBEPBE
basis: SDD
operation: Freq
keyword: #p
keyword: freq=noraman
keyword: PBEPBE/SDD
title: #p freq=noraman PBEPBE/SDD
converged: YES YES NO NO
title: Mulliken charges:
elementType: C C C C C C C C C C C C C C C H H H H H H H H H H H H H H H H H H H H H H H H H H H H
charge: -0.385552 -0.385286 -0.384678 -0.385373 -0.381918 -0.373879 -0.372712 -0.372214 -0.353338 -0.378666 -0.356648 -0.508190 -0.696791 0.222761 -0.524567 0.193185 0.193978 0.193708 0.192371 0.192548 0.192985 0.192413 0.195587 0.191747 0.191959 0.194071 0.187519 0.189104 0.189244 0.220542 0.186148 0.187536 0.187585 0.209638 0.200453 0.194662 0.194652 0.225555 0.231560 0.209593 0.214782 0.209662 0.274265
chargesum: 0.00000
title: Mulliken charges with hydrogens summed into heavy atoms:
elementType: C C C C C C C C C C C C C C C
charge: 0.001612 0.000793 0.000855 0.002627 0.001788 0.007711 0.005635 0.034476 0.021783 0.031425 0.032666 -0.051075 -0.062755 0.222761 -0.250302
polarizability: 2.01997741e+02 -5.73740926e+00 1.52705147e+02 1.66092970e+00 -4.45852294e+00 1.27721961e+02
1716.lowfreq: -17.4919 -0.0013 -0.0011 0.0004 1.5122 7.1447 8.7805 23.9813 26.8829
frequency: 6.7877 23.0674 26.8452 39.4553 57.5104 63.4342 81.2710 93.1586 100.5461 124.7005 130.9082 147.2355 152.1478 156.4971 167.1356 195.7058 230.6388 232.6404 305.1805 319.3309 330.7584 398.3825 420.9433 481.5047 491.6511 551.4146 632.4858 638.5620 718.1580 719.6432 723.9668 733.3545 751.0085 778.4048 817.7639 842.6658 857.7832 888.0191 899.3008 944.3494 977.7690 986.8107 990.3533 1006.0413 1026.2852 1030.4600 1039.3874 1062.0842 1075.7944 1078.7575 1080.0096 1082.7534 1086.8457 1114.0938 1122.6809 1180.3704 1188.1871 1200.6658 1213.2344 1226.5915 1239.0203 1251.5943 1263.5554 1272.4066 1276.5403 1282.6004 1286.4125 1289.4070 1290.9402 1296.9379 1297.7502 1310.9760 1318.9180 1332.9813 1347.9402 1352.9354 1355.8728 1357.1521 1361.6235 1388.5372 1455.8213 1458.6915 1459.0506 1460.8573 1462.2424 1463.6982 1465.1970 1469.1105 1474.0953 1477.4084 1479.0721 1483.5689 1487.0200 1488.8478 2135.9846 2948.2391 2948.3897 2949.6078 2950.5339 2951.2355 2954.1719 2958.0349 2961.5376 2964.5311 2967.8082 2970.7629 2971.2188 2978.3248 2980.6937 2983.4222 2987.4707 2993.1961 3000.8685 3009.7301 3016.9524 3022.5582 3027.2013 3034.7094 3041.5188 3050.3651 3067.5549 3070.0320 3427.4047
redmass: 2.9453 2.1907 3.8090 3.3518 1.8166 3.0229 3.1854 1.9389 2.4384 2.1343 1.9935 2.2521 2.8243 1.9752 3.8556 2.6386 3.2524 1.1217 4.2404 3.0779 2.6713 3.2301 3.2501 3.2040 2.9986 3.0869 1.2314 1.2193 1.0579 1.0655 1.0806 1.1179 1.1852 1.2485 1.3723 2.3313 1.4140 1.9008 1.3728 1.2815 5.2205 2.5001 1.4310 4.0720 1.3298 1.9552 3.5380 2.9230 2.5436 2.5068 2.0942 2.1381 2.4030 1.4729 2.7796 1.8747 1.2544 1.5622 1.3195 1.4156 1.3002 1.3270 1.2795 1.2429 1.0257 1.0523 1.2160 1.2314 1.0722 1.1176 1.1182 1.3056 1.3204 1.3904 1.4789 1.7085 1.6321 1.6167 1.5761 1.2170 1.0883 1.0748 1.0742 1.0751 1.0690 1.0633 1.0767 1.0839 1.0854 1.0425 1.0876 1.0915 1.0946 1.0947 6.0508 1.0584 1.0585 1.0588 1.0590 1.0593 1.0595 1.0597 1.0599 1.0592 1.0584 1.0592 1.0366 1.0623 1.0957 1.0963 1.0975 1.0994 1.1012 1.1019 1.1023 1.1015 1.1034 1.1047 1.1045 1.1042 1.1007 1.0993 1.1580
irintensity: 0.0598 0.0368 0.0484 0.0913 0.0304 0.0655 0.0098 0.0160 0.0386 0.0100 0.0095 0.0110 0.0282 0.0047 0.0520 0.9700 0.3157 0.0008 1.6338 0.2260 6.0694 0.7439 0.3079 0.7208 0.2904 1.7233 79.7962 79.0642 19.7251 0.0064 7.1541 0.0862 2.7256 0.1395 0.7256 2.0505 0.7894 4.7519 0.2035 1.0825 0.0806 1.4020 0.4021 0.0183 0.2289 0.1595 0.4215 0.1360 3.2113 0.8310 0.4441 0.8387 3.1058 0.8933 11.3679 0.3932 14.4529 2.1022 3.6990 0.0306 0.5951 0.0963 0.4170 0.2820 0.0210 0.6569 0.0251 0.2559 0.3321 0.1744 0.2763 0.2736 3.9145 0.6646 0.7883 0.3285 0.7360 0.0138 3.1562 11.1086 12.6774 0.3344 0.0298 0.8293 0.0171 0.5368 0.1525 0.8374 0.9465 12.2332 1.4588 1.8269 4.5887 41.0324 9.6323 0.2234 0.0071 0.8495 1.0661 0.3726 2.5162 0.4832 10.7868 113.8928 198.9415 41.4989 36.3941 63.1656 1.1721 1.7358 1.7746 1.2798 0.8584 0.4302 2.9501 17.5083 8.3987 2.3085 200.4923 181.6489 99.1584 55.7675 59.6788
temp: 298.150 k
press: 1.00000 atm
elementType: 6 6 6 6 6 6 6 6 6 6 6 6 6 6 6 1 1 1 1 1 1 1 1 1 1 1 1 1 1 1 1 1 1 1 1 1 1 1 1 1 1 1 1
symmnumber: 1
zpe: 1023562.8 jmol-1
zpe.correction: 0.389854 hartree
zpe.thermalcorrener: 0.410149 hartree
zpe.thermalcorrenthalpy: 0.411093 hartree
zpe.thermalcorrgfe: 0.336206 hartree
zpe.sumelectzpe: -587.095500 hartree
zpe.sumelectthermal: -587.075206 hartree
zpe.sumelectthermalent: -587.074262 hartree
zpe.sumelectthermalfe: -587.149149 hartree
dipole: 0.3800 -0.8564 0.1886
dipole: 0.9558
quadrupole: -104.9504 -94.1428 -96.5842
quadrupole: 4.8919 -1.3601 -2.7435
quadrupole: -6.3913 4.4163 1.9749 4.8919 -1.3601 -2.7435
hfenergy: -587.4853547 hartree
pointgroup: C01 [X(C15H28)]
dipole: -0.1537089 0.3395655 0.0496357 debye
polarizability: 202.1360714|-5.2528162|153.0796395|-1.1577376|2.6039931|127.2091387 unknown
InChI: InChI=1S/C15H28/c1-3-5-7-9-11-13-15-14-12-10-8-6-4-2/h1H,4-15H2,2H3
charge 0 multiplicity 1
43 atoms
C  -1.055748 -0.071249 0.282048
C  0.186461 0.662338 -0.271901
C  -2.388432 0.458606 -0.293421
C  1.518531 0.134133 0.306438
C  -3.630456 -0.276824 0.258615
C  2.760628 0.868447 -0.246994
C  -4.963454 0.255248 -0.314435
C  4.090657 0.338412 0.334014
C  -6.20558 -0.483019 0.233715
C  5.325827 1.080443 -0.219763
C  -7.538564 0.051983 -0.337861
C  6.674218 0.562348 0.359642
C  -8.773934 -0.693294 0.212396
C  6.967378 -0.842055 0.01227
C  7.217514 -2.013171 -0.28656
H  -1.072289 0.021086 1.388387
H  -0.968223 -1.156218 0.063073
H  0.204221 0.567734 -1.378001
H  0.097832 1.747745 -0.055023
H  -2.476864 1.543263 -0.072879
H  -2.371292 0.367871 -1.399891
H  1.500222 0.228019 1.412555
H  1.607967 -0.950754 0.088958
H  -3.646469 -0.188468 1.365271
H  -3.543206 -1.361039 0.035713
H  2.78009 0.771863 -1.3528
H  2.669975 1.954142 -0.03143
H  -5.052336 1.338833 -0.088801
H  -4.946043 0.169694 -1.421354
H  4.186811 -0.743196 0.112601
H  4.071896 0.431855 1.440283
H  -6.223636 -0.400045 1.340813
H  -6.119587 -1.566327 0.005686
H  5.349052 0.991234 -1.323471
H  5.245365 2.16135 0.01428
H  -7.518396 -0.029266 -1.444016
H  -7.624712 1.133785 -0.108004
H  6.659607 0.665863 1.463452
H  7.502757 1.200627 -0.006216
H  -8.833386 -0.602139 1.313582
H  -9.713112 -0.291774 -0.211027
H  -8.726914 -1.771642 -0.031443
H  7.436524 -3.032841 -0.545006
