program: Gaussian 09
title: 000069724
version: EM64L-G09RevD.01
frameworkgroup: C1[X(C7H7N5O)]
method: RPBEPBE
basis: SDD
operation: Freq
keyword: #pfreq=noraman
keyword: PBEPBE/SDD
title: #p freq=noraman PBEPBE/SDD
converged: YES YES NO YES
title: Mulliken charges:
elementType: O N N N N N C C C C C C C H H H H H H H
charge: -0.192043 -0.408167 0.047912 -0.024004 -0.038992 -0.614191 0.178149 -0.162314 0.226118 0.156469 0.002088 -0.378957 -0.779697 0.324477 0.254877 0.268107 0.231196 0.231246 0.360478 0.317248
chargesum: 0.00000
title: Mulliken charges with hydrogens summed into heavy atoms:
elementType: O N N N N N C C C C C C C
charge: -0.192043 -0.083690 0.047912 -0.024004 -0.038992 0.063535 0.178149 -0.162314 0.226118 0.156469 0.002088 -0.124080 -0.049148
polarizability: 1.77194776e+02 -3.38954793e+00 1.24633965e+02 -3.12079111e-03 -1.02604934e-03 4.99163421e+01
1716.lowfreq: -39.8256 -0.0007 -0.0005 -0.0001 1.6584 10.0084 11.5506 46.4089 142.1180
frequency: -39.6629 46.3491 142.1177 147.1364 196.1388 214.2220 295.3968 321.4232 359.7451 367.2518 415.1786 444.7344 476.2138 536.7829 546.4601 551.6835 601.1887 622.6105 633.6973 682.4403 697.1025 716.1793 815.4849 822.3441 907.9224 917.3765 972.1768 986.4164 1024.3610 1049.7163 1117.5542 1183.3180 1243.6847 1271.3942 1276.6785 1330.8887 1358.8173 1394.8041 1435.2897 1459.2202 1465.4671 1469.7109 1518.2389 1538.5920 1588.8627 1599.1131 1643.0040 2986.8958 3065.1584 3121.0603 3143.2070 3509.2624 3549.1957 3701.6031
redmass: 1.0584 4.4063 5.3477 5.0918 6.0443 3.9204 1.1234 3.7879 4.4347 4.7358 5.8391 7.8739 7.6060 1.9537 7.7244 1.4210 5.9663 1.3246 7.0198 6.8254 9.1585 6.6476 11.0073 6.4296 5.4499 1.3538 2.7528 1.7581 2.6665 1.5729 4.3268 3.8773 3.3124 7.3401 1.8765 4.9438 2.3030 1.2550 3.5909 3.1680 1.4714 1.0457 5.6950 4.7521 2.7001 2.5895 2.9323 1.0384 1.0975 1.0982 1.0931 1.0777 1.0455 1.1054
irintensity: 0.5769 3.7074 0.0096 2.7687 2.1242 8.6548 61.9995 1.1954 0.0478 5.6203 1.5369 4.2363 2.0080 193.8088 1.1638 104.5177 1.4050 85.1024 2.1305 0.8128 18.5752 0.0013 6.1944 0.7630 11.7510 9.6011 25.6874 36.0459 24.6575 8.2372 3.7968 28.2709 8.6442 9.4046 26.8655 19.2482 108.6178 16.1946 305.7776 21.4897 45.0733 17.8328 86.3581 79.9317 350.1142 320.6544 437.8870 16.0813 16.6252 4.0007 17.2107 32.8209 134.7308 47.4127
temp: 298.150 k
press: 1.00000 atm
elementType: 8 7 7 7 7 7 6 6 6 6 6 6 6 1 1 1 1 1 1 1
symmnumber: 1
zpe: 379699.9 jmol-1
zpe.correction: 0.144620 hartree
zpe.thermalcorrener: 0.154934 hartree
zpe.thermalcorrenthalpy: 0.155879 hartree
zpe.thermalcorrgfe: 0.108516 hartree
zpe.sumelectzpe: -619.014660 hartree
zpe.sumelectthermal: -619.004346 hartree
zpe.sumelectthermalent: -619.003401 hartree
zpe.sumelectthermalfe: -619.050764 hartree
dipole: 1.0279 -7.9343 -0.0002
dipole: 8.0006
quadrupole: -46.8373 -87.8925 -75.7135
quadrupole: -11.9604 -0.0019 0.0001
quadrupole: 23.3104 -17.7447 -5.5657 -11.9604 -0.0019 0.0001
hfenergy: -619.1592799 hartree
pointgroup: C01 [X(C7H7N5O1)]
dipole: -0.3049384 3.1328893 -0.0000905 debye
dipolederiv: -0.5209879 0.0561549 -0.0000184 0.0628175 -1.1370255 0.0000911 -0.0000074 0.0000362 -0.3374502 -1.5111749 -0.0776457 -0.0000536 -0.1926014 -0.5324111 0.0000025 -0.0000971 -0.0000246 -0.2712474 -0.1038465 0.261719 0.0000389 -0.0611372 -0.1081317 -0.0000055 0.0000291 0.0000038 -0.2371354 -0.3862034 0.2236972 0.0000221 -0.109545 -0.2408537 -0.0000123 -0.0000498 -0.0000087 -0.2619713 -1.0114359 0.5442791 -0.0000608 0.5328274 -1.2129744 0.000067 -0.0000721 0.0001016 -0.3133619 -1.5454364 0.4712026 -0.000022 0.483135 -0.4346707 -0.0000133 0.0000178 -0.0000388 -0.732959 1.0812442 -0.1447333 0.0000053 -0.7005933 -0.0398375 -0.000024 -0.0000469 -0.0000208 0.1897344 -0.3474635 -0.3012529 -0.0000586 0.4471799 -0.1050158 0.0000148 0.0000442 0.0000448 0.1228068 0.5615584 -0.1994269 -0.0000145 -0.6249631 -0.202004 -0.0000208 0.0001247 -0.0000805 0.0809657 2.1410131 -0.2611548 0.0001511 -0.2149025 1.5615234 0.0000089 0.0002436 0.0000274 0.2539437 1.2532424 -0.3323154 0.0000912 -0.1437979 1.5050081 -0.0001596 0.0000114 -0.0001689 0.1770224 -0.0423225 -0.1141615 0.0000248 0.5504098 0.3196872 0.0000519 0.0000921 0.0000812 -0.0373284 -0.3189168 0.0602349 -0.0000313 0.0239349 0.0213072 -0.0000701 -0.0004178 -0.0000075 0.0544905 0.1301117 -0.032932 -0.0000054 0.0159013 0.1564084 -0.0000259 -0.0000046 -0.0000285 0.3395267 -0.0296891 -0.0816189 -0.0000074 -0.1091991 0.0380486 -0.0000105 0.0000088 -0.0000047 0.1250837 0.1038311 -0.0467322 -0.0000372 0.0609233 -0.0583195 -0.0002066 0.0001221 -0.0001842 0.1233425 -0.0037263 0.0036486 0.0669975 -0.0021187 0.0787967 0.086667 0.1155266 0.0516648 -0.0348744 -0.0037243 0.0037996 -0.0669806 -0.0017945 0.0791476 -0.0863814 -0.1154287 -0.0514508 -0.0352382 0.3225529 -0.0010494 -0.0000203 0.0583406 0.1601619 0.0000102 -0.0000231 0.0000076 0.3973662 0.2313736 -0.031713 -0.0000209 -0.0748169 0.1511548 0.0000168 -0.0000728 0.0000506 0.3972835 unknown
polarizability: 176.9261466|-5.0533386|124.9025943|0.0031518|0.0009263|49.9163421 unknown
InChI: InChI=1S/C7H7N5O/c1-3-2-9-5-4(10-3)6(13)12-7(8)11-5/h2,11H,8H2,1H3
charge 0 multiplicity 1
20 atoms
O  -0.769234 -2.709939 0.000077
N  -1.37756 1.366389 0.000056
N  1.505098 -0.926813 -0.000205
N  0.925844 1.867625 0.000099
N  -2.237625 -0.887391 -0.000177
N  -3.701596 0.928528 -0.000243
C  -0.05492 0.919914 0.000015
C  0.214248 -0.48239 -0.000091
C  2.508465 0.001671 -0.000158
C  -2.41786 0.428157 -0.000116
C  -0.939869 -1.463761 -0.000021
C  2.200434 1.396547 0.000026
C  3.934234 -0.498059 -0.000284
H  -1.526575 2.379404 0.000206
H  2.997012 2.147923 0.000085
H  3.93119 -1.598563 -0.001369
H  4.486871 -0.144571 -0.890421
H  4.48633 -0.146423 0.890932
H  -4.450616 0.239414 -0.000333
H  -3.922669 1.920636 -0.000378
