program: Gaussian 09
title: 000004378
version: EM64L-G09RevD.01
frameworkgroup: C1[X(C6H13NO2)]
method: RPBEPBE
basis: SDD
operation: Freq
keyword: #p
keyword: freq=noraman
keyword: PBEPBE/SDD
title: #p freq=noraman PBEPBE/SDD
converged: YES YES NO NO
title: Mulliken charges:
elementType: O O N C C C C C C H H H H H H H H H H H H H
charge: -0.421129 -0.217244 -0.350312 -0.080540 -0.077055 -0.705675 -0.699549 0.149126 -0.643218 0.193665 0.219021 0.210031 0.238848 0.209730 0.214869 0.205325 0.255419 0.259871 0.219130 0.256897 0.189778 0.373014
chargesum: 0.00000
title: Mulliken charges with hydrogens summed into heavy atoms:
elementType: O O N C C C C C C
charge: -0.048115 -0.217244 -0.090441 0.113124 0.141965 -0.047066 -0.023936 0.149126 0.022587
polarizability: 8.40272268e+01 -1.04626914e+00 7.87160860e+01 4.03110161e+00 -4.94876183e-01 7.17034988e+01
1716.lowfreq: -12.9084 -0.0003 0.0004 0.0005 10.9059 13.9834 40.0034 80.7309 107.7748
frequency: 39.9694 80.7079 107.7557 162.4181 182.1587 206.7080 212.1358 234.7733 273.4216 312.2981 329.2700 422.6198 439.5796 467.1395 528.8691 609.1706 646.0920 691.8750 814.6270 861.5176 924.9535 947.7946 964.9946 985.7167 1033.7192 1101.3347 1112.7962 1114.1901 1174.7523 1188.8645 1204.3630 1239.5470 1257.5684 1303.9406 1327.3525 1363.3614 1383.1317 1400.7988 1439.1958 1459.1089 1467.1550 1471.0184 1476.3720 1477.8672 1489.3033 1497.7545 1670.0444 2864.4107 2877.9060 2943.7831 2980.2700 2982.4339 3031.3751 3071.5255 3072.4008 3086.3982 3089.8444 3094.1705 3490.7733 3506.3800
redmass: 5.4843 3.2632 2.2579 3.1848 2.2449 1.3246 1.1296 1.1080 2.9942 2.8170 2.8930 2.7178 2.3806 3.4522 1.8508 1.3259 3.2427 3.2650 3.7614 2.8991 1.2223 1.7753 1.5447 2.5467 2.7307 1.5620 1.4977 1.5040 3.2271 2.0427 2.0726 1.5740 1.5403 1.2366 1.5106 1.5305 1.2066 1.2080 1.1791 1.1786 1.0480 1.0500 1.0882 1.0524 1.0520 1.0526 8.1905 1.0799 1.0567 1.0831 1.0358 1.0367 1.0746 1.0996 1.0994 1.1004 1.0989 1.0997 1.0750 1.0639
irintensity: 0.9239 0.1013 2.7379 0.8963 1.5439 1.1153 0.7276 0.4145 0.8096 10.2669 3.9368 8.5427 17.3070 10.1506 110.2705 67.2775 39.8497 57.9297 0.6312 6.0776 3.7445 12.2139 1.7178 89.1892 196.7271 4.6956 5.7247 6.5922 36.3323 3.8934 13.8806 9.0191 10.6975 9.3251 1.7400 9.9313 24.8492 15.5154 11.1038 14.6289 2.5736 1.8523 11.9715 7.3179 16.8366 22.4756 191.6783 53.6207 155.5816 40.1156 28.8036 27.1498 34.9917 24.0206 46.7027 25.0243 39.7264 17.9506 0.4162 21.8925
temp: 298.150 k
press: 1.00000 atm
elementType: 8 8 7 6 6 6 6 6 6 1 1 1 1 1 1 1 1 1 1 1 1 1
symmnumber: 1
zpe: 491616.0 jmol-1
zpe.correction: 0.187247 hartree
zpe.thermalcorrener: 0.198493 hartree
zpe.thermalcorrenthalpy: 0.199437 hartree
zpe.thermalcorrgfe: 0.150580 hartree
zpe.sumelectzpe: -440.881365 hartree
zpe.sumelectthermal: -440.870118 hartree
zpe.sumelectthermalent: -440.869174 hartree
zpe.sumelectthermalfe: -440.918032 hartree
dipole: -0.7860 -0.7831 -2.0044
dipole: 2.2910
quadrupole: -55.0430 -47.8773 -61.2054
quadrupole: -1.7828 -4.2080 0.8881
quadrupole: -0.3344 6.8313 -6.4968 -1.7828 -4.2080 0.8881
hfenergy: -441.0686112 hartree
pointgroup: C01 [X(C6H13N1O2)]
dipole: 0.3647988 -0.0907821 0.8192136 debye
dipolederiv: -0.429408 -0.1533401 -0.0367761 -0.2290495 -1.0605712 -0.3608643 -0.0096664 -0.2981554 -0.3812566 -0.5139095 -0.0965807 -0.2703629 0.0645985 -0.5689774 0.110415 -0.3475434 -0.1160478 -0.7446595 -0.6635948 -0.1622827 0.1235272 -0.1157531 -0.3862411 -0.1183571 0.1331102 -0.1955555 -0.4972406 0.2820732 -0.1270111 0.0445383 -0.0120336 0.128115 0.0131637 -0.0322649 0.0167895 0.1239748 0.0457874 0.3154089 -0.0923202 0.3535182 0.3172838 0.0765508 -0.1254146 0.0944561 0.2514589 -0.0456628 -0.0587154 -0.0278892 -0.0384782 0.0010623 -0.0378242 -0.0108564 -0.0427391 0.033625 -0.0314841 -0.0292053 0.0154201 -0.02799 0.0484867 -0.0625119 -0.0002616 -0.0530724 -0.0939648 0.4907143 0.1472592 0.4729455 -0.0067845 1.3290326 0.1234356 0.5720376 0.2170661 0.8601274 0.4915593 0.0126785 -0.1672772 -0.1055489 0.0987538 0.0778062 -0.089449 0.0568211 0.3430174 0.0102858 0.0163333 -0.0188827 0.0108629 -0.1689715 0.1185989 0.0157322 0.1037877 -0.0351007 0.0080327 -0.0124852 0.0304568 -0.0640368 -0.0707379 -0.0761163 -0.0313581 -0.1176751 -0.1862635 0.088841 -0.0084849 0.057504 -0.0184246 0.0684853 -0.0304297 -0.0000546 -0.0473034 -0.182843 0.1145093 0.0271973 -0.0181557 -0.0193296 -0.0809044 0.0632707 -0.0167123 0.1005732 0.0352795 -0.1838291 0.0465066 0.0172941 0.0833507 0.0592344 -0.0116381 0.0483443 -0.0226793 0.0871895 0.0922429 0.0068509 0.0022789 -0.0111968 -0.1120975 0.1168383 0.0116826 0.0599013 0.0181472 -0.1440923 0.1191175 0.074151 0.1058264 0.0477821 -0.0231469 0.0380239 -0.0055627 0.0617125 0.0452045 -0.1007386 -0.1001477 -0.0768736 0.022755 -0.0545959 -0.0784655 -0.0443379 0.0526626 0.0710118 0.0590833 -0.0447077 0.0282849 0.0982271 0.0710782 -0.099093 0.1715582 0.2216191 -0.0037153 -0.0884245 0.0104271 -0.1555667 -0.1179778 -0.0181567 0.0176893 -0.0378541 0.0989992 0.0358573 0.064425 -0.0241716 0.1417409 0.0199855 0.0692258 -0.0665975 0.0822124 0.0008257 -0.0774567 -0.0252257 0.0440027 0.073574 0.0530428 -0.120266 0.1827097 -0.0544354 -0.2536372 0.317033 0.0476339 -0.0918548 0.0193094 0.2742323 0.0735241 -0.1115925 0.1322525 0.1863272 unknown
polarizability: 83.3680679|2.6922773|79.5815682|3.4299302|-0.1324761|71.4971755 unknown
InChI: InChI=1S/C6H13NO2/c1-4(2)5(7-3)6(8)9/h4-5,7-8H,1-3H3
charge 0 multiplicity 1
22 atoms
O  -0.169356 2.158539 0.231867
O  -1.215984 0.883558 -1.396197
N  -0.95459 -1.413448 0.325365
C  1.39259 -0.611054 0.236893
C  -0.10481 -0.239219 0.549438
C  2.393304 0.402889 0.832912
C  1.631127 -0.842405 -1.273043
C  -0.572248 0.928088 -0.328786
C  -2.377204 -1.291672 0.682693
H  1.548243 -1.580098 0.761674
H  -0.141517 0.138465 1.602268
H  2.258902 0.512549 1.925232
H  2.26905 1.401722 0.380084
H  3.429677 0.065918 0.646495
H  1.629041 0.114854 -1.826909
H  2.611891 -1.324413 -1.439237
H  0.839969 -1.481901 -1.700389
H  -0.513414 -2.267625 0.681942
H  -2.87338 -2.266895 0.536486
H  -2.869296 -0.568973 0.008501
H  -2.557029 -0.964187 1.736201
H  -0.465267 2.893207 -0.372487
