program: Gaussian 09
title: 000069719
version: EM64L-G09RevD.01
frameworkgroup: C1[X(C10H12N2)]
method: RPBEPBE
basis: SDD
operation: Freq
keyword: #pfreq=noraman
keyword: PBEPBE/SDD
title: #p freq=noraman PBEPBE/SDD
converged: YES YES NO NO
title: Mulliken charges:
elementType: N N C C C C C C C C C C H H H H H H H H H H H H
charge: -0.303832 -0.018279 -0.486293 0.424160 -0.345169 -0.432617 -0.439888 -0.376215 -0.219680 -0.222034 -0.241473 -0.148633 0.200655 0.229382 0.229626 0.207114 0.256037 0.267901 0.239776 0.232569 0.265597 0.226412 0.225908 0.228977
chargesum: 0.00000
title: Mulliken charges with hydrogens summed into heavy atoms:
elementType: N N C C C C C C C C C C
charge: -0.047794 -0.018279 -0.056256 0.424160 0.091571 0.075060 -0.207319 -0.110618 0.006733 0.003873 -0.012497 -0.148633
polarizability: 1.69163040e+02 5.75465364e+00 1.08606907e+02 -1.01741544e+01 2.18602001e+00 6.65162245e+01
1716.lowfreq: -14.0853 -9.9680 -4.3661 -0.0010 -0.0010 -0.0009 23.3265 41.2914 54.6938
frequency: 22.9729 41.2139 54.6698 94.1270 130.5848 136.4789 223.9276 279.7212 287.8386 374.8139 404.5325 420.0609 488.0792 513.0907 602.1569 616.0874 688.9945 707.8463 749.1948 784.0317 810.7868 857.9758 915.1712 930.4429 969.7933 980.8824 990.0643 996.9784 1008.9228 1025.4492 1043.6822 1081.0325 1095.1833 1142.1556 1169.9244 1171.0787 1182.8900 1213.0470 1232.7802 1272.8150 1281.9673 1310.6370 1338.3567 1376.1869 1391.7725 1440.3194 1447.0462 1456.4484 1476.1528 1484.8736 1496.3944 1594.2533 1614.9635 2199.8753 2876.7120 2892.7239 2976.6158 2995.0272 3028.9818 3062.7592 3115.4213 3125.3705 3138.6782 3151.2947 3164.0272 3433.6311
redmass: 4.4875 3.2770 4.7115 2.5563 3.2894 3.9420 4.0645 3.3499 5.2249 3.5410 2.8408 3.4100 3.2691 6.9894 4.6888 6.2832 1.4252 1.7690 1.5664 1.2072 3.6437 1.2467 1.3478 4.7487 1.8332 1.3948 6.1648 1.3938 2.0619 2.1716 3.3538 1.5738 1.9147 4.4041 1.1047 1.0587 1.1081 2.4640 1.3026 1.2895 1.1322 1.3779 1.3267 2.2492 2.4498 2.1158 1.0871 1.2096 1.3525 1.6299 1.0898 6.1376 6.1169 12.4338 1.0701 1.0710 1.0879 1.0614 1.0880 1.1000 1.0868 1.0866 1.0920 1.0953 1.1013 1.0745
irintensity: 0.9284 3.4050 3.2798 2.1500 7.8753 5.4664 2.3768 0.4621 2.1998 0.7499 0.3080 4.4554 10.6052 4.2807 5.9810 0.7764 76.7074 58.3454 66.2208 1.9301 4.6869 0.0932 4.5053 1.7356 8.7119 0.2467 0.1132 2.6323 13.3415 8.6795 4.6722 10.5120 1.2774 69.7046 5.3986 0.5049 0.5315 3.2173 8.2764 2.6968 3.1103 13.7947 17.1289 4.8569 0.6520 9.8629 11.4028 39.4894 22.8677 3.9407 4.8828 0.6542 5.7184 15.8123 60.2745 115.6884 25.7018 7.2517 18.5828 15.1256 8.4637 0.3573 24.0394 30.4352 20.4851 0.6047
temp: 298.150 k
press: 1.00000 atm
elementType: 7 7 6 6 6 6 6 6 6 6 6 6 1 1 1 1 1 1 1 1 1 1 1 1
symmnumber: 1
zpe: 517875.2 jmol-1
zpe.correction: 0.197248 hartree
zpe.thermalcorrener: 0.208996 hartree
zpe.thermalcorrenthalpy: 0.209940 hartree
zpe.thermalcorrgfe: 0.157177 hartree
zpe.sumelectzpe: -496.857728 hartree
zpe.sumelectthermal: -496.845980 hartree
zpe.sumelectthermalent: -496.845036 hartree
zpe.sumelectthermalfe: -496.897799 hartree
dipole: 3.9162 -0.1193 -1.0301
dipole: 4.0511
quadrupole: -102.4968 -65.7495 -71.8562
quadrupole: -2.2072 1.4078 0.1857
quadrupole: -22.4627 14.2847 8.1780 -2.2072 1.4078 0.1857
hfenergy: -497.0549766 hartree
pointgroup: C01 [X(C10H12N2)]
dipole: -1.523125 -0.3698678 0.2891722 debye
dipolederiv: -0.9680894 -0.0025432 -0.0470542 0.0128518 -0.4269426 -0.1920757 -0.0774479 -0.1872924 -0.2947251 -0.3851565 -0.0252973 -0.0217291 0.006947 -0.2356345 0.0016224 0.0693449 0.0118551 -0.2262676 0.4449214 0.0421716 0.1446576 -0.0681406 0.3785561 0.0749211 0.4049122 0.0876848 0.3212642 0.1698596 -0.0080716 -0.1044547 0.0114424 -0.0513334 -0.0288714 -0.2150803 -0.0004535 -0.0090601 0.7370651 -0.0603455 -0.0310389 0.0866764 0.3894179 0.0122967 -0.0662302 0.0242191 0.1834034 -0.1464128 -0.0356404 0.0165038 -0.0321435 0.1701294 -0.0671906 -0.0223148 -0.0577647 0.1692955 -0.1593078 -0.0140546 -0.0178545 -0.0040543 0.0140636 0.1115978 -0.0100753 0.1135682 -0.1027706 -0.0981484 0.0856855 0.0231281 0.1068518 -0.0400839 0.0348236 0.0731021 0.034201 -0.1528692 0.0243239 0.0918989 -0.0027305 0.1043631 0.0151212 0.0603545 0.0206005 0.0641978 -0.1184025 -0.0337485 -0.0233203 -0.0429032 -0.0360754 0.0609578 0.1213977 -0.051254 0.1258668 -0.0748766 0.046622 -0.0133564 -0.065555 -0.0259425 -0.0933264 0.0468689 -0.0626779 0.0432808 -0.1295451 0.2451418 -0.0051759 -0.065124 -0.0402106 -0.0592623 -0.0049916 -0.1841811 -0.0170445 -0.0642001 -0.0559676 -0.0033139 -0.023486 -0.0371955 -0.2156728 -0.14558 -0.0960497 -0.0883985 -0.0103863 -0.0372534 -0.0227819 0.0861519 -0.0525921 0.0089356 0.1071657 0.012598 0.064124 -0.0830591 0.0502433 0.0063305 -0.0200915 0.0001745 0.0230589 0.0836507 0.0327323 0.0710068 -0.1029558 -0.1598252 0.0590568 0.0118912 0.159997 -0.1926353 -0.073153 0.0372851 -0.0449241 0.0341702 0.1527476 -0.0229925 -0.0255071 -0.0611822 0.1731658 0.1601623 -0.0216705 0.0820049 0.0557694 0.0781307 0.0426116 0.024278 0.0078674 -0.0411705 -0.0316797 0.0093283 -0.0121324 0.1071918 0.0456058 -0.0020443 0.0287506 -0.015728 0.0727683 0.0918901 0.020694 0.0582284 -0.0477826 0.0797932 0.060988 0.0498865 0.04051 -0.038584 -0.1094875 0.0359584 -0.1127384 0.084195 0.0612875 -0.1011024 -0.0163607 -0.1206156 0.0380914 -0.0380683 -0.0201699 -0.0421173 0.1257319 -0.039305 -0.1072519 -0.0146736 -0.1209022 0.0008199 -0.0558637 -0.0153413 -0.0565152 0.1327922 0.0620641 0.0333931 0.0361484 0.0524406 -0.0503127 -0.1198361 0.0430432 -0.1193606 0.0817687 -0.1145913 0.025156 0.0771671 0.0246604 0.0998728 -0.039954 0.0828938 -0.0414957 0.1213185 unknown
polarizability: 168.8915493|5.6498956|96.3835785|-12.1802156|18.7265353|79.0110444 unknown
InChI: InChI=1S/C10H12N2/c11-7-4-8-12-9-10-5-2-1-3-6-10/h1-3,5-6,12H,4,8-9H2
charge 0 multiplicity 1
24 atoms
N  0.94134 -0.083622 0.089064
N  5.830399 0.422973 -0.040928
C  -0.070594 -0.500984 -0.910481
C  -1.490937 -0.275816 -0.403302
C  2.33998 -0.18619 -0.36137
C  3.263652 0.516276 0.670793
C  -2.506805 -1.227955 -0.666015
C  -1.823581 0.901921 0.314105
C  -3.83409 -1.005605 -0.231506
C  -3.147366 1.123563 0.753553
C  -4.158517 0.17186 0.480352
C  4.68362 0.467012 0.28635
H  0.040256 -1.567099 -1.226307
H  0.101957 0.111003 -1.820155
H  2.429641 0.329989 -1.33539
H  2.692875 -1.23411 -0.516414
H  0.785739 -0.550162 0.993898
H  2.942668 1.568702 0.777221
H  3.149889 0.040435 1.664799
H  -2.25986 -2.147232 -1.212199
H  -1.03232 1.629423 0.52468
H  -4.609508 -1.750748 -0.442527
H  -3.392326 2.037845 1.306328
H  -5.18561 0.34472 0.820951
