program: Gaussian 09
title: 000069700
version: EM64L-G09RevD.01
frameworkgroup: C1[X(C9H13NO)]
method: RPBEPBE
basis: SDD
operation: Freq
keyword: #p
keyword: freq=noraman
keyword: PBEPBE/SDD
title: #p freq=noraman PBEPBE/SDD
converged: YES YES NO NO
title: Mulliken charges:
elementType: O N C C C C C C C C C H H H H H H H H H H H H H
charge: -0.273128 -0.157136 0.410025 -0.357810 -0.329280 0.318678 -0.362252 -0.371572 -0.647158 -0.646666 -0.537080 0.231883 0.235962 0.232151 0.241565 0.228531 0.214041 0.228229 0.229420 0.213451 0.229256 0.214757 0.214698 0.239437
chargesum: 0.00000
title: Mulliken charges with hydrogens summed into heavy atoms:
elementType: O N C C C C C C C C C
charge: -0.273128 -0.157136 0.410025 -0.125927 -0.093318 0.318678 -0.130101 -0.130008 0.023643 0.025461 0.131812
polarizability: 1.67353402e+02 -9.31664277e-01 1.07477656e+02 -6.17760694e-03 -5.10264054e-02 5.97944637e+01
1716.lowfreq: -9.3183 -0.0009 -0.0007 -0.0007 11.8781 15.2576 56.9736 70.1271 85.8627
frequency: 56.9706 70.0594 85.7538 124.9614 175.0098 209.8135 216.1706 252.6841 264.3994 331.8446 374.2025 419.8905 435.3019 480.8027 516.5533 524.4291 633.5821 666.3436 715.7450 780.6719 785.7566 808.5903 903.3866 935.3907 945.7831 985.7574 1001.6965 1057.3243 1108.8679 1112.5463 1113.2129 1124.5994 1157.2819 1166.9741 1187.0650 1229.7466 1270.0337 1317.9563 1356.0845 1381.5999 1426.3066 1435.1150 1439.6663 1459.6912 1461.7453 1463.0755 1471.9359 1475.2980 1497.2326 1509.9639 1520.9533 1574.0463 1641.0979 2923.8921 2933.7865 2945.9074 2983.4402 2987.7213 3027.7628 3089.5265 3099.0628 3115.1954 3144.4723 3147.6789 3166.3770 3172.2192
redmass: 2.9899 2.5692 2.4788 2.1757 3.2610 1.2903 1.1457 1.3152 3.1029 4.2133 4.8981 3.0228 3.5613 3.3571 2.1937 3.5786 6.8799 4.5456 3.3256 5.9316 1.3088 1.7271 1.3761 1.3400 3.2000 4.7590 3.6363 1.4757 1.3124 1.2596 1.2407 1.4080 1.3968 1.5873 1.4402 2.1939 2.9200 1.4407 3.6132 6.0454 1.6075 1.1858 1.7678 1.2141 1.0406 1.0507 1.0465 1.0701 1.0895 1.1243 2.3081 7.1904 6.3680 1.0372 1.0399 1.0335 1.0994 1.1021 1.1033 1.0949 1.0930 1.0983 1.0864 1.0873 1.0947 1.0956
irintensity: 8.8745 0.3160 0.0487 4.2263 2.4800 2.1467 0.7602 2.5885 1.6689 1.8156 0.2504 0.0124 4.0019 0.8251 20.8558 4.2619 0.2455 19.1788 0.3323 13.0430 14.8174 86.6361 0.3471 0.3585 15.6439 16.9405 57.7518 28.3956 1.1083 0.2191 0.0264 4.9259 2.6980 8.2960 45.2459 186.2789 45.8192 4.6817 57.1421 7.7283 14.4400 12.6497 4.0937 36.6150 0.1961 12.0822 19.6496 47.9533 1.7127 3.4923 452.3203 1.3855 26.0972 137.4870 94.0540 72.3443 24.6350 88.0511 60.9337 4.5901 50.6175 31.0915 17.9512 8.7354 27.3873 4.0206
temp: 298.150 k
press: 1.00000 atm
elementType: 8 7 6 6 6 6 6 6 6 6 6 1 1 1 1 1 1 1 1 1 1 1 1 1
symmnumber: 1
zpe: 528737.5 jmol-1
zpe.correction: 0.201385 hartree
zpe.thermalcorrener: 0.212999 hartree
zpe.thermalcorrenthalpy: 0.213943 hartree
zpe.thermalcorrgfe: 0.163798 hartree
zpe.sumelectzpe: -479.861005 hartree
zpe.sumelectthermal: -479.849391 hartree
zpe.sumelectthermalent: -479.848447 hartree
zpe.sumelectthermalfe: -479.898592 hartree
dipole: -1.9378 -1.6802 -0.0030
dipole: 2.5648
quadrupole: -51.5144 -61.0070 -71.1361
quadrupole: -5.9672 -0.0071 -0.0047
quadrupole: 9.7048 0.2122 -9.9170 -5.9672 -0.0071 -0.0047
hfenergy: -480.06239 hartree
pointgroup: C01 [X(C9H13N1O1)]
dipole: -0.7724411 0.6480535 0.0398016 debye
dipolederiv: -1.809444 -0.1977868 0.0041041 -0.1089131 -0.3434792 -0.0013712 0.0087883 -0.0010715 -0.2951148 -1.6904151 0.0288494 0.0147887 0.0891069 -0.5685995 -0.0134368 0.0217271 -0.015043 -0.2962528 1.6041241 -0.1142382 -0.0206567 -0.1034309 -0.2561533 -0.0171572 -0.0214468 -0.016468 0.1091164 -0.3186453 0.2248522 0.0114717 -0.3656342 0.0750612 0.0182239 -0.0167668 0.0126792 -0.2378734 -0.2375142 -0.1727695 -0.0080826 0.3612442 0.0699906 0.0109532 0.0180294 0.0156414 -0.2361098 1.4122848 0.0181049 -0.0112863 -0.2233866 -0.2227631 -0.010951 -0.0233322 -0.0125365 0.0428424 -0.0936444 -0.2186453 -0.0115751 0.2369571 0.0905997 0.0110621 0.0099948 0.0149344 -0.1918545 -0.1079298 0.1934438 0.0083829 -0.191339 0.1412397 0.0160112 -0.0100271 0.01249 -0.1599165 0.2232201 -0.1413819 -0.005981 -0.4234689 0.5548628 0.0159118 -0.0200956 0.0132481 0.2778757 0.326556 0.1962465 0.0094432 0.4621434 0.4868994 0.0060571 0.0215369 0.008711 0.2750495 0.6366456 0.1493342 0.0044662 0.5432177 0.4181195 -0.0012967 0.0235684 0.002316 0.3427659 0.0382487 0.0841414 0.005098 0.0925631 -0.0711748 -0.0118383 0.0055216 -0.0118611 0.1636574 0.0135023 -0.1078698 -0.0036221 -0.1017312 -0.0409222 -0.0085931 -0.0030819 -0.0082548 0.1622062 0.0127658 -0.1004377 -0.0031681 -0.1206767 -0.0341082 -0.007971 -0.004081 -0.0081299 0.162269 0.0581266 0.0780297 0.004717 0.0824002 -0.0428732 -0.0105595 0.004645 -0.0105992 0.16444 0.0950669 -0.0743129 -0.0848645 0.1015812 -0.0861723 -0.0989681 0.013787 -0.1383317 -0.1158865 -0.190244 0.0186407 0.0055216 -0.0747527 0.0954014 0.0006062 0.0006872 -0.000503 0.1147272 0.0958355 -0.0764368 0.0715128 0.1077462 -0.110305 0.0980848 -0.0105375 0.1426522 -0.096527 0.0853233 0.0405447 0.0602997 -0.1334929 -0.0832331 -0.1065062 -0.042348 -0.1401749 -0.1174197 -0.173738 0.0217859 0.0037562 0.1191996 0.0792124 -0.0028995 0.0086849 -0.0018662 0.114611 0.0852445 0.0490029 -0.0592736 -0.1347969 -0.1083859 0.1101644 0.0251872 0.1403395 -0.0919137 0.0567922 0.0296755 0.0644878 -0.1474962 -0.0452789 -0.1103872 -0.0243573 -0.1167793 -0.1166251 0.0557876 0.0373048 -0.0633743 -0.1476136 -0.067842 0.1177458 0.0079059 0.1211087 -0.0937661 -0.1779491 0.0339224 0.0038344 0.080573 0.0699039 -0.0028849 0.0060105 -0.0025011 0.1196991 unknown
polarizability: 167.3010902|1.8991808|107.4159618|-0.9152303|2.2326407|59.9084694 unknown
InChI: InChI=1S/C9H13NO/c1-10(2)8-4-6-9(11-3)7-5-8/h4-7H,1-3H3
charge 0 multiplicity 1
24 atoms
O  3.123472 -0.454726 -0.088575
N  -2.53078 0.126285 -0.006057
C  -1.129814 0.014469 -0.02622
C  -0.288866 1.166579 0.019307
C  -0.487788 -1.264809 -0.092851
C  1.729604 -0.221014 -0.064792
C  1.119232 1.052823 0.000438
C  0.912452 -1.375394 -0.111517
C  -3.154421 1.449097 0.065561
C  -3.361704 -1.078954 -0.059306
C  3.989242 0.720118 -0.038148
H  -0.725867 2.167896 0.07025
H  -1.082937 -2.181544 -0.129869
H  1.720461 1.966994 0.036897
H  1.39452 -2.357031 -0.162377
H  -2.858704 1.99874 0.984301
H  -4.250708 1.339269 0.077707
H  -2.887048 2.083639 -0.806137
H  -3.1892 -1.662942 -0.987899
H  -4.425528 -0.792994 -0.035363
H  -3.173215 -1.753244 0.802608
H  3.836494 1.298297 0.895541
H  3.824386 1.384915 -0.910086
H  5.016519 0.326332 -0.064014
