program: Gaussian 09
title: 000069681
version: EM64L-G09RevD.01
frameworkgroup: C1[X(C7H5ClN2)]
method: RPBEPBE
basis: SDD
operation: Freq
keyword: #p
keyword: freq=noraman
keyword: PBEPBE/SDD
title: #p freq=noraman PBEPBE/SDD
converged: NO NO NO NO
title: Mulliken charges:
elementType: Cl N N C C C C C C C H H H H H
charge: -0.062138 -0.438009 -0.002687 0.214910 0.296667 -0.346739 -0.321205 -0.431823 -0.103256 -0.175589 0.268600 0.243474 0.272131 0.330411 0.255252
chargesum: 0.00000
title: Mulliken charges with hydrogens summed into heavy atoms:
elementType: Cl N N C C C C C C C
charge: -0.062138 -0.107598 -0.002687 0.214910 0.296667 -0.078139 -0.077731 -0.159691 -0.103256 0.079663
polarizability: 1.45191373e+02 -3.48750348e+00 9.78712116e+01 -1.39187651e-03 2.28804954e-03 3.75892367e+01
1716.lowfreq: 0.0027 0.0027 0.0031 7.7005 11.4081 19.7800 116.1354 221.8066 229.1858
frequency: 116.1163 221.8037 229.1852 321.9896 348.9447 417.7933 420.4305 542.8189 570.3273 587.7813 644.5099 678.0664 740.9534 772.1713 800.6382 829.7345 888.4827 892.0526 915.1238 942.0183 1040.3908 1057.8287 1135.2934 1193.6188 1233.2342 1255.1583 1277.8983 1333.1164 1384.5484 1425.6140 1454.4413 1472.8535 1579.0908 1625.9678 3149.4399 3166.7606 3172.4217 3229.6085 3624.7591
redmass: 8.5557 8.6999 4.6007 5.9309 14.5544 4.4282 2.9252 1.9967 6.9787 2.3649 2.6802 7.6238 3.3061 5.9118 1.5084 1.2995 1.4881 6.2310 3.7271 1.3251 3.5078 2.6298 1.3913 1.6750 2.0777 1.9541 2.1702 2.7631 3.5455 2.6405 3.6355 4.0217 6.3548 7.7464 1.0886 1.0936 1.0973 1.0977 1.0821
irintensity: 0.0088 0.3322 0.5109 0.0432 3.2120 2.5912 9.8177 35.0391 5.3278 51.1180 46.1387 22.8444 0.6860 13.0727 50.0060 21.1647 35.9964 41.0091 17.4935 0.4953 1.4660 29.4622 6.3497 24.0815 10.0186 2.7401 5.4892 18.7654 28.0920 0.4020 2.8524 50.6125 8.7571 1.0206 3.0541 1.4298 5.0920 1.6587 83.1281
temp: 298.150 k
press: 1.00000 atm
elementType: 17 7 7 6 6 6 6 6 6 6 1 1 1 1 1
symmnumber: 1
zpe: 279286.1 jmol-1
zpe.correction: 0.106374 hartree
zpe.thermalcorrener: 0.113814 hartree
zpe.thermalcorrenthalpy: 0.114758 hartree
zpe.thermalcorrgfe: 0.073779 hartree
zpe.sumelectzpe: -838.602362 hartree
zpe.sumelectthermal: -838.594922 hartree
zpe.sumelectthermalent: -838.593978 hartree
zpe.sumelectthermalfe: -838.634957 hartree
dipole: 0.9828 2.0610 0.0001
dipole: 2.2834
quadrupole: -72.1811 -52.2420 -68.0898
quadrupole: 5.5081 0.0005 0.0004
quadrupole: -8.0101 11.9290 -3.9189 5.5081 0.0005 0.0004
hfenergy: -838.7087361 hartree
pointgroup: C01 [X(C7H5Cl1N2)]
dipole: -0.3174695 0.8403767 -0.0000497 debye
dipolederiv: -0.7997931 0.1432113 -0.0000022 0.214991 -0.1713892 0.0000026 -0.0000178 0.0000056 -0.0729905 -0.4063039 -0.1315877 0.0000019 0.2053025 -0.4415357 -0.0000119 0.0000025 0.0000139 -0.2542081 -0.5426354 0.0321056 -0.0000015 -0.0667727 0.3731046 -0.0000163 0.0000127 -0.000029 -0.1967714 -0.0115864 -0.084881 0.0000095 0.1238777 -0.1472246 -0.0000012 0.0000008 0.0000037 0.0316821 0.4610966 -0.1058654 -0.0000049 -0.2769502 -0.1616956 0.0000179 -0.0000138 0.0000207 0.0425838 -0.1320328 0.1274829 -0.000008 0.0191298 0.0351733 -0.0000017 -0.0000087 0.0000019 -0.1045359 0.0032606 0.0926324 -0.0000014 0.0510559 0.1065504 -0.0000065 0.0000006 -0.000013 -0.153546 0.1418693 0.3119511 -0.0000221 0.1404173 0.1081159 -0.0000035 -0.0000141 -0.0000217 -0.1410051 1.097594 -0.3117725 0.0000128 -0.4077707 0.0825766 -0.0000045 0.0000321 -0.0000108 -0.0854461 -0.2744826 0.0174601 -0.0000019 0.0931697 0.069362 -0.0000075 -0.0000127 -0.0000094 -0.1153823 0.086802 0.019153 0.0000008 0.0393643 -0.0137255 0.0000051 -0.0000002 0.0000031 0.172634 0.0578944 0.0551796 -0.0000016 0.0264668 -0.0713874 0.0000084 0.0000027 0.0000072 0.1789867 0.0763807 -0.024789 0.0000046 -0.0367168 -0.0059247 0.000005 0.0000054 0.0000077 0.1794987 0.230384 -0.0586081 0.0000091 -0.0632057 0.1955722 0.0000093 0.0000064 0.0000123 0.3546072 0.0115526 -0.0816723 0.000005 -0.062359 0.0424275 0.0000049 0.0000039 0.0000078 0.1638929 unknown
polarizability: 145.4416403|-0.5072913|97.620944|-0.0015785|-0.0021635|37.5892367 unknown
InChI: InChI=1S/C7H5ClN2/c8-6-1-2-7-5(3-6)4-9-10-7/h1-4,10H
charge 0 multiplicity 1
15 atoms
Cl 3.583139 -0.719672 -0.000014
N  -2.171332 0.83758 0.000004
N  -2.813515 -0.401264 0.000096
C  -0.513834 -0.690297 0.000006
C  -0.784289 0.725108 -0.000045
C  0.829547 -1.153203 0.000016
C  0.251536 1.690585 -0.000086
C  -1.811963 -1.320027 0.000054
C  1.839422 -0.184149 -0.000041
C  1.574933 1.217505 -0.000077
H  1.069917 -2.220193 0.000046
H  0.048389 2.765957 -0.00012
H  -2.060836 -2.379468 0.000086
H  -2.742924 1.678648 -0.000017
H  2.412909 1.921191 -0.000109
