program: Gaussian 09
title: 000069674
version: EM64L-G09RevD.01
frameworkgroup: C1[X(C8H11N)]
method: RPBEPBE
basis: SDD
operation: Freq
keyword: #pfreq=noraman
keyword: PBEPBE/SDD
title: #p freq=noraman PBEPBE/SDD
converged: NO YES NO NO
title: Mulliken charges:
elementType: N C C C C C C C C H H H H H H H H H H H
charge: -0.007018 -0.217584 0.539222 -0.686657 -0.686644 -0.387399 -0.339382 -0.326529 -0.346884 0.208883 0.211619 0.216257 0.228883 0.228881 0.216256 0.211628 0.233138 0.229683 0.237659 0.235989
chargesum: 0.00000
title: Mulliken charges with hydrogens summed into heavy atoms:
elementType: N C C C C C C C C
charge: -0.007018 -0.008701 0.539222 -0.029898 -0.029879 -0.154261 -0.109700 -0.088871 -0.110895
polarizability: 1.11687724e+02 8.25798114e-01 9.20216784e+01 2.63945959e-03 -7.15796314e-03 5.85033231e+01
1716.lowfreq: -14.6166 -9.0062 0.0005 0.0006 0.0006 4.7744 41.9763 124.5794 200.7486
frequency: 41.6794 124.5658 200.7481 216.9197 257.7431 296.2089 308.9785 369.9841 449.5243 551.3703 561.0934 661.7739 739.7980 754.5936 828.3979 883.6393 891.4033 919.1689 957.0477 961.6474 962.5138 974.3552 1048.2306 1060.7391 1086.2632 1110.1756 1152.9782 1217.4462 1227.0448 1285.5536 1304.9559 1319.4501 1355.4673 1378.4610 1396.8690 1404.8864 1464.0252 1466.4504 1468.6966 1478.8875 1488.9792 1555.4424 1584.7854 2974.6732 2977.3022 2980.5597 3068.8983 3076.4082 3077.3154 3081.3348 3121.2071 3122.1066 3143.5924 3150.0136
redmass: 3.0102 3.4967 2.2825 1.0372 1.1789 2.7496 3.9119 2.4736 3.0100 3.0814 2.9456 6.9733 3.7542 3.0583 1.4835 1.2460 2.5360 1.1774 1.4721 6.9072 1.3627 1.4928 1.6781 2.0740 1.5842 2.5590 1.8672 1.4018 1.6794 2.9897 1.3256 2.7616 1.3314 1.1912 1.2094 1.9840 1.8655 1.0488 1.0461 1.0485 1.1003 6.5082 5.5822 1.0348 1.0353 1.0844 1.1002 1.0992 1.1008 1.1000 1.0864 1.0884 1.0958 1.0987
irintensity: 0.0210 0.2995 0.2695 0.0253 0.0377 0.4222 1.7922 0.0068 0.8301 0.9985 26.2322 0.4130 8.7366 2.6396 49.3465 0.0292 5.5556 3.4381 0.0562 3.7975 0.2105 0.1174 16.6816 1.4699 4.2623 0.7980 0.4500 0.3775 5.7078 8.9891 0.4900 1.7509 2.0635 14.9834 7.0202 21.7223 3.3215 6.7801 0.0057 15.4556 17.2152 12.1118 54.8526 30.5743 27.3426 17.8638 1.1325 86.6322 23.1732 40.1067 7.6943 14.0763 58.0897 0.7563
temp: 298.150 k
press: 1.00000 atm
elementType: 7 6 6 6 6 6 6 6 6 1 1 1 1 1 1 1 1 1 1 1
symmnumber: 1
zpe: 445862.3 jmol-1
zpe.correction: 0.169820 hartree
zpe.thermalcorrener: 0.178556 hartree
zpe.thermalcorrenthalpy: 0.179500 hartree
zpe.thermalcorrgfe: 0.136026 hartree
zpe.sumelectzpe: -365.520481 hartree
zpe.sumelectthermal: -365.511745 hartree
zpe.sumelectthermalent: -365.510801 hartree
zpe.sumelectthermalfe: -365.554275 hartree
dipole: 3.2850 -0.4823 0.0003
dipole: 3.3202
quadrupole: -62.4243 -48.4332 -57.2239
quadrupole: 1.5344 -0.0005 -0.0021
quadrupole: -6.3972 7.5939 -1.1967 1.5344 -0.0005 -0.0021
hfenergy: -365.6903012 hartree
pointgroup: C01 [X(C8H11N1)]
dipole: -1.293956 0.1788399 0.0001124 debye
dipolederiv: -0.4080529 -0.004448 0.000005 -0.0034821 -0.3895243 -0.0000283 0.0000101 -0.0000289 -0.2555691 0.0401711 -0.0350018 -0.0000334 -0.123729 0.1646567 0.0000277 -0.0001244 0.0000284 0.1063873 0.467911 0.0002529 0.0000045 -0.0383635 0.0826961 0.0000477 -0.0000059 0.0000482 -0.0764854 -0.0294743 -0.0198731 0.0365404 0.0213476 0.0618103 0.0221004 -0.0331439 0.0405949 -0.0217307 -0.029486 -0.0198424 -0.0365635 0.021315 0.0618641 -0.0220298 0.0332011 -0.0405215 -0.021787 -0.3651658 -0.1439785 -0.0000251 -0.0806565 0.0173704 0.0000339 0.0000015 0.0000357 -0.1090612 -0.276546 0.1837605 0.0000507 0.1837356 -0.0819431 -0.0000011 0.0000588 -0.0000035 -0.1089976 0.28838 0.1850503 0.0000248 0.0381406 0.2523242 0.0000718 -0.0000208 0.0000593 -0.0627922 0.2448569 -0.162454 -0.0000598 -0.0305925 0.3135213 0.0000954 -0.0000283 0.0001078 -0.0811308 0.0262349 -0.0153035 -0.0000014 0.0424512 -0.1796859 -0.0000883 0.0000257 -0.0000766 0.0205207 0.0974822 0.0568996 0.0087131 0.0194708 -0.1466658 0.0347773 0.0066984 -0.0290071 0.0683549 -0.2165508 0.0393563 0.0378347 0.0400333 0.084342 0.0140512 0.0167126 0.0151816 0.07636 0.0764267 -0.0506507 -0.0950494 -0.0345622 0.046986 -0.0820139 -0.059147 -0.0549737 -0.1130389 0.0764371 -0.0507354 0.0949907 -0.0346023 0.04686 0.0821682 0.0591063 0.0551101 -0.112916 -0.2165582 0.0393771 -0.0377796 0.0400269 0.084369 -0.0140509 -0.0166712 -0.0151784 0.0763356 0.0974676 0.0569159 -0.0086673 0.0194889 -0.1466458 -0.0349691 -0.0066804 0.02882 0.0683523 0.0602109 0.102697 0.0000346 0.0618434 -0.0791017 -0.0000584 0.0000266 -0.0000602 0.1440619 0.0148056 -0.1220102 -0.0000243 -0.1070097 -0.0210138 -0.0000311 -0.0000273 -0.0000307 0.1375761 0.0002409 -0.1118438 -0.0000172 -0.0970092 -0.0621224 -0.0000397 -0.0000151 -0.0000383 0.1321842 0.0512091 0.0718316 0.0000223 0.0621537 -0.1100971 -0.0000628 0.0000229 -0.0000673 0.1333759 unknown
polarizability: 111.6724169|0.9913322|92.0369856|-0.0026997|0.0071355|58.5033231 unknown
InChI: InChI=1S/C8H11N/c1-7(2)8-3-5-9-6-4-8/h3-7H,1-2H3
charge 0 multiplicity 1
20 atoms
N  2.550362 -0.223003 -0.000202
C  -1.804948 0.421995 0.00025
C  -0.295025 0.195774 0.000102
C  -2.466429 -0.16293 1.277878
C  -2.466483 -0.161844 -1.277868
C  0.616096 1.281817 0.000302
C  0.264307 -1.109428 -0.000265
C  2.008534 1.031037 0.000134
C  1.667827 -1.268148 -0.000392
H  -1.982026 1.516741 0.000712
H  -2.336726 -1.260166 1.328586
H  -3.551479 0.049444 1.278432
H  -2.027243 0.272693 2.193574
H  -2.02736 0.274614 -2.193194
H  -3.55154 0.050476 -1.278152
H  -2.336705 -1.259025 -1.329539
H  0.247986 2.314391 0.000582
H  -0.377859 -1.997261 -0.000452
H  2.727442 1.858913 0.000278
H  2.118268 -2.267791 -0.000666
