program: Gaussian 09
title: 000069668
version: EM64L-G09RevD.01
frameworkgroup: C1[X(C7H10O2)]
method: RPBEPBE
basis: SDD
operation: Freq
keyword: #pfreq=noraman
keyword: PBEPBE/SDD
title: #p freq=noraman PBEPBE/SDD
converged: YES YES NO NO
title: Mulliken charges:
elementType: O O C C C C C C C H H H H H H H H H H
charge: -0.283032 -0.283584 0.287364 -0.510413 -0.452620 -0.198734 -0.329634 -0.299273 -0.214245 0.244074 0.240192 0.222833 0.229070 0.245748 0.232068 0.207605 0.221627 0.208676 0.232278
chargesum: 0.00000
title: Mulliken charges with hydrogens summed into heavy atoms:
elementType: O O C C C C C C C
charge: -0.283032 -0.283584 0.287364 -0.026147 -0.000718 0.047013 0.110039 0.131031 0.018033
polarizability: 1.04761698e+02 1.88801064e+00 6.90900004e+01 2.60483987e-01 -2.20210518e+00 5.81686142e+01
1716.lowfreq: -16.5208 -14.1926 -0.0011 -0.0009 -0.0005 10.0840 28.4286 54.4180 188.7221
frequency: 26.6572 54.2780 188.7184 253.0858 299.4191 412.8927 422.9432 479.1676 614.7297 680.2426 691.1404 740.0766 776.3313 807.0559 849.2295 867.9342 914.6557 922.2369 954.2296 972.0557 983.3417 1008.1148 1032.6549 1075.0605 1101.8986 1122.5576 1150.0415 1162.7339 1184.9108 1204.8029 1212.6110 1254.1613 1291.3537 1315.9323 1323.6954 1347.3461 1445.0102 1465.1287 1470.1908 1477.3305 1630.1888 2980.8562 2987.7760 2988.0921 3031.8750 3038.4525 3077.6303 3098.5962 3105.7569 3145.3978 3184.1787
redmass: 2.6827 2.7646 2.1655 2.4762 2.9565 5.6112 4.3311 2.4082 2.4184 1.8828 7.6718 5.3225 1.6275 3.5216 1.6662 2.1107 3.4511 2.5993 1.3274 3.0510 3.2994 2.8362 2.0210 1.6106 1.4639 2.4955 1.1814 1.2116 1.7668 1.6552 1.2471 1.5207 1.6313 1.2790 1.2434 1.8174 1.0807 1.0958 1.0899 1.0941 6.3518 1.0689 1.0607 1.0602 1.0947 1.0677 1.1009 1.1013 1.1040 1.0877 1.1063
irintensity: 5.4085 6.4296 0.4709 0.9677 4.3827 5.3849 10.3668 16.8034 2.4321 0.0300 9.6344 1.1362 68.8678 11.6940 20.4836 13.9693 40.5068 15.7932 5.1162 10.8512 8.3963 37.7921 28.5995 90.7792 0.3910 104.2745 3.0961 0.9908 26.2899 4.5598 5.7354 16.8621 1.5532 1.0071 1.6633 49.5605 5.1392 18.2830 6.2771 0.7912 7.7153 65.1099 77.7560 36.2152 17.1588 19.1993 35.8382 33.8624 13.1088 11.5215 14.8347
temp: 298.150 k
press: 1.00000 atm
elementType: 8 8 6 6 6 6 6 6 6 1 1 1 1 1 1 1 1 1 1
symmnumber: 1
zpe: 411663.5 jmol-1
zpe.correction: 0.156794 hartree
zpe.thermalcorrener: 0.164958 hartree
zpe.thermalcorrenthalpy: 0.165902 hartree
zpe.thermalcorrgfe: 0.122682 hartree
zpe.sumelectzpe: -422.447393 hartree
zpe.sumelectthermal: -422.439230 hartree
zpe.sumelectthermalent: -422.438285 hartree
zpe.sumelectthermalfe: -422.481506 hartree
dipole: 0.7296 0.2253 0.0349
dipole: 0.7644
quadrupole: -41.6692 -51.0131 -59.7797
quadrupole: 1.1545 -0.3738 -1.8476
quadrupole: 9.1515 -0.1924 -8.9590 1.1545 -0.3738 -1.8476
hfenergy: -422.6041873 hartree
pointgroup: C01 [X(C7H10O2)]
dipole: 0.2851405 -0.090849 0.0298679 debye
dipolederiv: -1.043478 0.0885799 0.0107676 0.0660057 -0.5191298 -0.1033236 0.1243004 -0.0708013 -0.4568241 -1.0930266 -0.1445721 -0.0793031 -0.1656866 -0.4811336 -0.0979012 -0.1132837 -0.0846286 -0.4498659 1.3627538 0.0511016 0.030209 0.2834421 0.6598283 0.0911399 -0.1367093 0.1230408 0.5770962 -0.1368699 0.0490608 -0.0432554 0.068956 -0.027988 0.0957309 -0.0922378 0.0906807 -0.0399261 -0.0145963 0.0216712 0.0101112 0.0700439 0.021169 0.1427208 0.0024262 0.120901 0.1209726 -0.2186035 0.0243425 -0.0250965 -0.1064825 -0.1840726 -0.0852807 0.111622 -0.1044637 -0.2104339 0.5175538 -0.0889274 0.0169296 0.006269 0.2709784 -0.0653334 0.214446 -0.1361527 0.2714956 0.6533044 0.141708 0.0247583 -0.0569806 0.1902543 -0.0978984 -0.1613033 -0.1058039 0.2546608 0.1002633 -0.0400804 0.0149238 -0.1277708 0.0490462 -0.1936733 0.0662469 -0.1849196 -0.0709586 0.0581617 -0.0057858 0.0268663 -0.0092045 0.0906544 -0.0441203 0.0248864 -0.0119006 -0.0895271 0.054968 -0.0564427 0.0052934 -0.051377 -0.0991545 0.0077429 0.0145015 -0.0295404 0.0932277 -0.0420706 -0.0337342 -0.0973794 -0.0374273 0.0672741 -0.0268962 -0.159518 0.0010285 -0.0598878 0.017837 0.058182 0.057566 0.1316125 -0.0659292 -0.0570651 0.0669487 -0.0744415 0.0195572 0.0564429 0.0624725 -0.0412749 0.0287268 0.0231879 0.1191394 -0.0361752 0.1196305 0.0841628 -0.086676 0.0414751 0.088049 0.023871 0.0900839 0.0042272 0.1180422 -0.0251174 -0.0031968 0.0027422 -0.0110482 -0.0097117 0.0476959 -0.1196602 0.0968605 -0.1033504 0.1451277 -0.0439793 -0.0711102 -0.0197831 -0.0957084 -0.0009959 0.0912266 0.0253107 -0.1446708 -0.0044887 -0.0652065 -0.0858759 -0.0598202 0.0376535 -0.0908543 -0.0967756 0.0801652 0.1336252 0.1239714 -0.0182378 -0.0317199 -0.0783992 0.0686015 -0.0798434 0.0401404 0.1084546 0.0702031 0.1078778 0.0868712 unknown
polarizability: 104.6550866|-2.2694123|65.7578793|1.4609278|-5.5755048|61.6073466 unknown
InChI: InChI=1S/C7H10O2/c1-2-4-7(3-1)8-5-6-9-7/h1,3H,2,4-6H2
charge 0 multiplicity 1
19 atoms
O  0.97146 -0.560142 -1.023334
O  0.868809 0.866284 0.86691
C  0.017124 0.082162 -0.088504
C  -0.987542 0.957592 -0.878417
C  -2.407661 0.567749 -0.365267
C  -0.833404 -0.899313 0.685838
C  2.259731 -0.649427 -0.307918
C  2.285581 0.669925 0.485703
C  -2.155317 -0.634858 0.532838
H  -0.872675 0.733412 -1.95191
H  -0.754677 2.022459 -0.718322
H  -3.099268 0.320309 -1.193052
H  -2.88007 1.389311 0.207602
H  -0.387687 -1.690249 1.29438
H  3.049376 -0.736612 -1.070198
H  2.277729 -1.531094 0.363697
H  2.879962 0.622809 1.413377
H  2.629464 1.512816 -0.145239
H  -2.968436 -1.198234 1.003016
