program: Gaussian 09
title: 000069664
version: EM64L-G09RevD.01
frameworkgroup: C1[X(C2F4O)]
method: RPBEPBE
basis: SDD
operation: Freq
keyword: #p
keyword: freq=noraman
keyword: PBEPBE/SDD
title: #p freq=noraman PBEPBE/SDD
converged: NO NO NO NO
title: Mulliken charges:
elementType: F F F F O C C
charge: -0.125252 -0.125253 -0.125260 -0.125264 -0.166310 0.333669 0.333671
chargesum: 0.00000
title: Mulliken charges with hydrogens summed into heavy atoms:
polarizability: 3.10058543e+01 -9.98064690e-07 2.64461418e+01 8.57843257e-05 -7.64858197e-06 2.10684371e+01
1716.lowfreq: -18.5136 -11.3583 -0.0017 0.0005 0.0005 4.1571 165.3334 192.5293 284.1902
frequency: 165.3334 192.5289 284.1902 437.3057 453.0131 458.3444 467.1158 589.7657 678.0683 700.8796 980.1880 1041.0909 1067.6584 1113.2959 1491.1767
redmass: 18.3015 18.9935 17.9712 16.7504 17.5970 17.2134 16.7180 16.2868 12.3066 17.8926 13.9785 13.4950 13.0854 13.4581 12.2837
irintensity: 4.5307 0.0000 0.1664 6.4948 0.0851 0.0000 5.3985 57.4691 9.7967 10.8165 407.8707 155.1589 0.0001 431.1879 60.6309
temp: 298.150 k
press: 1.00000 atm
elementType: 9 9 9 9 8 6 6
symmnumber: 1
zpe: 60530.8 jmol-1
zpe.correction: 0.023055 hartree
zpe.thermalcorrener: 0.029088 hartree
zpe.thermalcorrenthalpy: 0.030032 hartree
zpe.thermalcorrgfe: -0.007165 hartree
zpe.sumelectzpe: -550.194170 hartree
zpe.sumelectthermal: -550.188137 hartree
zpe.sumelectthermalent: -550.187193 hartree
zpe.sumelectthermalfe: -550.224390 hartree
dipole: 0.0002 0.0000 -0.5927
dipole: 0.5927
quadrupole: -38.9618 -39.2679 -37.2693
quadrupole: 0.0000 -0.0002 0.0000
quadrupole: -0.4621 -0.7682 1.2304 0.0000 -0.0002 0.0000
hfenergy: -550.2172253 hartree
pointgroup: C01 [X(C2F4O1)]
dipole: 0.0000819 -0.0000071 -0.2331689 debye
dipolederiv: -0.5270482 -0.2507998 0.1631707 -0.2948858 -0.632157 0.1543741 0.095642 0.0844887 -0.2548663 -0.5270561 0.2507998 0.1631727 0.2948876 -0.63215 -0.1543732 0.0956438 -0.0844886 -0.2548679 -0.527035 -0.2507928 -0.1631941 -0.2948687 -0.6321625 -0.1543924 -0.0956685 -0.0845176 -0.2549006 -0.5270424 0.2507918 -0.1631948 0.2948679 -0.6321524 0.1543901 -0.0956695 0.0845164 -0.2549036 -0.7144194 -0.0000023 0.0000186 -0.0000036 -0.3527797 0.0000002 0.0000083 -0.0000003 -0.8678966 1.4113049 0.0000002 -0.341589 0.0000007 1.4407025 -0.0000001 -0.5192914 -0.0000016 0.9436812 1.4112963 0.0000032 0.3416158 0.0000019 1.440699 0.0000013 0.5193352 0.000003 0.9437536 unknown
polarizability: 31.0058543|0.000036|26.4461418|0.0000858|-0.0000076|21.0684371 unknown
InChI: InChI=1S/C2F4O/c3-1(4)2(5,6)7-1
charge 0 multiplicity 1
7 atoms
F  1.495534 1.130005 -0.301877
F  1.495548 -1.129982 -0.30188
F  -1.495508 -1.130003 -0.301991
F  -1.495526 1.129982 -0.301994
O  -0.000062 0.0000 1.251598
C  0.740121 0.000007 -0.021962
C  -0.740107 -0.000008 -0.021994
