program: Gaussian 09
title: 000069657
version: EM64L-G09RevD.01
frameworkgroup: C1[X(C3H7NO2)]
method: RPBEPBE
basis: SDD
operation: Freq
keyword: #pfreq=noraman
keyword: PBEPBE/SDD
title: #p freq=noraman PBEPBE/SDD
converged: YES YES NO NO
title: Mulliken charges:
elementType: O O N C C C H H H H H H H
charge: -0.447525 -0.260640 -0.324583 -0.366875 -0.303506 -0.047736 0.228726 0.243375 0.224484 0.229684 0.311921 0.175514 0.337159
chargesum: 0.00000
title: Mulliken charges with hydrogens summed into heavy atoms:
elementType: O O N C C C
charge: -0.110365 -0.260640 -0.012661 0.105227 0.150662 0.127778
polarizability: 5.14547576e+01 -2.77654554e+00 4.67820806e+01 -6.14239300e+00 -2.24283964e+00 3.73435582e+01
1716.lowfreq: -32.5588 -14.4417 -0.0004 0.0009 0.0010 11.0604 44.8291 109.1632 206.0064
frequency: 44.7013 109.1361 205.9999 275.1787 290.2473 353.8024 516.8886 573.3305 729.1605 823.0115 864.6084 960.3646 982.5334 1029.9754 1072.4611 1172.3309 1194.1310 1262.9443 1328.5675 1354.1041 1363.2873 1372.0478 1428.0992 1467.2512 1468.3153 1639.9768 2930.0333 2996.8721 3013.0995 3081.2750 3092.0519 3549.4987 3562.9576
redmass: 5.9300 2.9172 3.3642 1.4734 1.7282 2.5489 2.4476 1.1141 3.8145 2.1948 3.1997 1.6125 2.0505 3.2779 1.8639 1.2764 2.2287 1.2098 1.1707 1.2916 1.2523 1.2142 1.1553 1.2829 1.3249 5.5994 1.0869 1.0644 1.0597 1.1016 1.1038 1.0788 1.0660
irintensity: 16.2556 12.1050 7.6475 209.2674 38.8082 12.8979 14.0296 53.2281 5.9040 28.4442 16.2416 2.5910 45.6620 48.9729 0.5859 27.5641 34.0428 10.6745 7.6014 5.2597 17.5242 20.4991 33.6852 56.2364 57.2259 231.9519 111.9848 32.9364 23.9801 16.3634 31.1978 18.4705 4.1160
temp: 298.150 k
press: 1.00000 atm
elementType: 8 8 7 6 6 6 1 1 1 1 1 1 1
symmnumber: 1
zpe: 275788.5 jmol-1
zpe.correction: 0.105042 hartree
zpe.thermalcorrener: 0.112102 hartree
zpe.thermalcorrenthalpy: 0.113046 hartree
zpe.thermalcorrgfe: 0.073502 hartree
zpe.sumelectzpe: -323.211405 hartree
zpe.sumelectthermal: -323.204345 hartree
zpe.sumelectthermalent: -323.203401 hartree
zpe.sumelectthermalfe: -323.242945 hartree
dipole: -0.2371 3.1702 0.6305
dipole: 3.2410
quadrupole: -48.9428 -32.9364 -33.4171
quadrupole: 7.0482 -1.3118 -2.4458
quadrupole: -10.5107 5.4957 5.0150 7.0482 -1.3118 -2.4458
hfenergy: -323.3164472 hartree
pointgroup: C01 [X(C3H7N1O2)]
dipole: -0.127528 1.2399725 0.268535 debye
dipolederiv: -0.4540338 0.1032017 -0.3182097 0.1615468 -0.5683524 -0.0107136 -0.3494419 -0.0365529 -0.5699244 -0.6678414 0.1227168 0.1116667 0.4772954 -0.8518692 -0.149284 0.0754186 0.0075838 -0.4068495 -1.0500435 0.1286303 0.1576614 0.0962027 -0.3785505 -0.102919 0.1682099 -0.1140496 -0.5875298 0.2984479 0.1331756 -0.1035254 0.1374221 0.2127349 -0.1117144 -0.1729658 -0.026553 0.2261236 0.3796019 -0.1168366 0.1497043 -0.1324996 0.4048508 -0.0656926 0.2296728 -0.1370768 0.4043804 1.1822203 -0.3402162 -0.4538423 -0.5675813 1.0311542 0.1261437 -0.4608042 0.0490088 0.3643955 0.0070961 0.0127536 0.094315 0.0081473 -0.0094929 -0.1211428 0.0820101 -0.0684251 -0.0011472 -0.0007691 0.0709851 -0.0972821 -0.0081136 0.0098728 0.1056127 -0.0249018 0.0550623 0.0319532 -0.0443952 -0.0900444 0.0697908 -0.0646065 0.0031306 0.0914159 0.0311054 0.1046561 0.013384 -0.0073063 0.1301868 0.0328784 0.0785694 -0.0278444 -0.0467081 0.0195783 -0.0771749 -0.0500571 0.178491 0.0078728 0.0940714 -0.0078144 0.1047843 0.0366811 0.1231397 0.0495084 0.2724768 -0.0097481 -0.0812364 0.0847444 -0.1490344 -0.1797564 0.1233858 0.1048624 0.0984982 0.0601115 0.1882803 -0.081189 0.1780271 -0.0295339 0.2493383 0.1249352 0.1741164 0.0955146 0.2426832 unknown
polarizability: 51.5527143|-2.5517049|46.702926|-6.1829207|-2.2551118|37.3247561 unknown
InChI: InChI=1S/C3H7NO2/c5-2-1-4-3-6/h3-5H,1-2H2
charge 0 multiplicity 1
13 atoms
O  -2.32815 0.205107 -0.67178
O  1.978428 -0.783831 -0.358334
N  0.464475 0.895406 0.239237
C  -0.456783 -0.001375 0.968073
C  -1.440283 -0.731985 0.031745
C  1.626754 0.428526 -0.347999
H  -1.024046 0.606336 1.694536
H  0.144339 -0.750283 1.516347
H  -2.112085 -1.368988 0.630575
H  -0.878743 -1.371378 -0.677593
H  0.279311 1.9001 0.233217
H  2.227727 1.242643 -0.815695
H  -1.794943 0.690622 -1.350827
