program: Gaussian 09
title: 000069653
version: EM64L-G09RevD.01
frameworkgroup: C1[X(C5H9NO)]
method: RPBEPBE
basis: SDD
operation: Freq
keyword: #pfreq=noraman
keyword: PBEPBE/SDD
title: #p freq=noraman PBEPBE/SDD
converged: YES YES NO NO
title: Mulliken charges:
elementType: O N C C C C C H H H H H H H H H
charge: -0.276228 -0.359445 -0.450894 0.271908 -0.017454 -0.765993 -0.543663 0.255421 0.221773 0.295296 0.209305 0.254500 0.253892 0.206040 0.215022 0.230521
chargesum: 0.00000
title: Mulliken charges with hydrogens summed into heavy atoms:
elementType: O N C C C C C
charge: -0.276228 -0.064148 0.026299 0.271908 0.191851 -0.051562 -0.098120
polarizability: 7.55921701e+01 4.41188641e+00 6.69049957e+01 -1.66298079e+00 7.57808468e-01 4.69675325e+01
1716.lowfreq: -4.0634 -0.0009 -0.0007 -0.0001 5.2740 11.7338 37.1729 62.2446 80.2508
frequency: 37.0386 62.1854 80.2420 129.6877 265.5509 338.7999 386.7939 433.2979 525.2704 585.7158 602.0880 665.6118 842.6920 914.4094 956.0442 964.7691 978.3800 997.7770 1040.6102 1080.6960 1143.0779 1243.3841 1261.6567 1290.5641 1343.8217 1385.1484 1427.6429 1447.9269 1450.7274 1468.0027 1487.1656 1622.8724 1659.5260 2988.3953 2994.9894 3073.1091 3087.1368 3095.9241 3100.7624 3101.4163 3200.8488 3558.9156
redmass: 3.7837 2.7361 1.1579 2.1097 3.1369 2.5500 2.1506 2.3050 1.3131 3.6338 2.1600 1.8710 2.7480 1.7876 1.4927 1.5988 1.7981 1.1863 1.6400 3.5409 1.9933 1.7643 1.3519 1.2668 1.2379 1.2244 1.1645 1.1496 1.0571 1.0846 1.7605 6.4718 4.6629 1.0651 1.0360 1.0869 1.0777 1.0999 1.0981 1.0859 1.1152 1.0779
irintensity: 4.7328 5.4433 1.4759 0.9325 5.8433 4.6804 0.7617 3.7742 105.9365 13.9412 14.4725 22.8560 5.5804 9.6512 50.0636 27.7689 8.2236 18.9410 13.0341 9.1309 16.5717 42.4664 79.8140 5.1289 2.5611 53.9320 8.5273 60.5555 10.2800 31.2135 146.7629 169.4928 5.6779 45.4668 13.5812 8.4918 13.2665 20.1434 8.4688 14.8051 23.9075 12.5959
temp: 298.150 k
press: 1.00000 atm
elementType: 8 7 6 6 6 6 6 1 1 1 1 1 1 1 1 1
symmnumber: 1
zpe: 348835.1 jmol-1
zpe.correction: 0.132864 hartree
zpe.thermalcorrener: 0.141373 hartree
zpe.thermalcorrenthalpy: 0.142317 hartree
zpe.thermalcorrgfe: 0.098633 hartree
zpe.sumelectzpe: -325.336386 hartree
zpe.sumelectthermal: -325.327878 hartree
zpe.sumelectthermalent: -325.326934 hartree
zpe.sumelectthermalfe: -325.370618 hartree
dipole: 0.2389 -3.8897 -0.9974
dipole: 4.0227
quadrupole: -39.3968 -43.1558 -42.6626
quadrupole: 4.1465 1.2077 -0.6124
quadrupole: 2.3416 -1.4174 -0.9241 4.1465 1.2077 -0.6124
hfenergy: -325.4692505 hartree
pointgroup: C01 [X(C5H9N1O1)]
dipole: 0.1114331 1.4804023 0.5484046 debye
dipolederiv: -0.5993448 0.0490365 0.0960057 -0.2569568 -0.9273027 -0.1818346 0.0101688 -0.2376323 -0.4875611 -1.0447537 -0.2553286 -0.0763509 -0.3809194 -0.6041972 0.0690865 0.0091767 0.2039939 -0.4752483 0.5591857 -0.0252032 -0.0317918 -0.1338678 0.1142743 -0.0651648 -0.1387405 -0.2158563 0.2856495 1.1892737 0.2994331 -0.2454555 0.6793972 1.2352831 0.2636347 -0.2189595 0.2598265 0.386695 -0.0586578 -0.0816417 0.1958941 -0.0219308 0.0709792 0.1245029 0.2432484 0.1639993 -0.0517274 -0.3575935 0.057326 0.1696612 0.009441 0.0454156 -0.0149869 0.1882922 -0.0306716 -0.0652813 -0.251545 -0.0115738 0.1908771 0.0051625 -0.0611866 0.1249054 0.1547064 0.0984707 -0.0988505 0.0829893 -0.0005461 -0.0344068 0.0587878 0.0289337 -0.118341 -0.0070459 -0.0294079 0.0501265 -0.0498926 -0.0035627 0.0098046 -0.0360491 -0.069882 0.1579883 0.0280514 0.1196451 0.0113813 0.1477325 -0.0287266 0.0749324 0.0037807 0.1406021 -0.0886524 0.1045461 -0.1046419 0.2602605 0.0927514 0.0122367 -0.0723404 -0.0121138 -0.0610484 -0.1254511 -0.1141196 -0.0990321 0.008025 -0.021461 -0.0080189 -0.0712111 -0.0088799 0.104938 -0.0483253 -0.1154996 -0.0269403 0.0310853 0.0992237 0.0120679 0.0085742 -0.0005284 0.0260708 0.1012178 0.059245 0.0769099 -0.0124197 0.0618617 -0.0353224 0.0162072 0.0400176 -0.142248 -0.0972961 0.035772 -0.0687485 0.0768676 0.0213601 0.0477558 -0.149579 0.0596376 0.0968638 -0.0100109 -0.1731088 -0.0029538 0.0292661 0.1288701 -0.0279318 -0.0808212 -0.0049785 0.0025044 -0.0912725 -0.0657333 -0.1069609 0.0517315 unknown
polarizability: 75.5051426|-4.6431654|66.630654|1.1208371|2.8005989|47.3289017 unknown
InChI: InChI=1S/C5H9NO/c1-3-4-6-5(2)7/h3,6H,1,4H2,2H3
charge 0 multiplicity 1
16 atoms
O  -1.16296 -1.269418 -0.578554
N  -0.417561 0.890509 -0.129372
C  0.91754 0.679278 -0.728004
C  -1.36458 -0.124909 -0.071327
C  2.001603 0.449853 0.314036
C  -2.669495 0.235065 0.637217
C  2.691902 -0.709104 0.446796
H  0.829752 -0.203058 -1.383911
H  1.165852 1.558596 -1.354489
H  -0.620023 1.785153 0.318473
H  2.217137 1.291402 0.990792
H  -3.512888 0.054764 -0.050917
H  -2.804028 -0.437302 1.502201
H  -2.710947 1.281023 0.98833
H  3.467171 -0.832941 1.21189
H  2.491725 -1.569811 -0.202262
