program: Gaussian 09
title: 000069647
version: EM64L-G09RevD.01
frameworkgroup: C1[X(C3HF5)]
method: RPBEPBE
basis: SDD
operation: Freq
keyword: #p
keyword: freq=noraman
keyword: PBEPBE/SDD
title: #p freq=noraman PBEPBE/SDD
converged: NO NO NO NO
title: Mulliken charges:
elementType: F F F F F C C C H
charge: -0.161655 -0.158400 -0.159237 -0.141556 -0.124512 0.405898 -0.374732 0.418800 0.295395
chargesum: 0.00000
title: Mulliken charges with hydrogens summed into heavy atoms:
elementType: F F F F F C C C
charge: -0.161655 -0.158400 -0.159237 -0.141556 -0.124512 0.405898 -0.079337 0.418800
polarizability: 4.63519758e+01 -3.44076214e+00 3.48245035e+01 -6.31123812e-03 -9.04305857e-03 2.34530075e+01
1716.lowfreq: -12.5536 -5.9091 -0.0009 0.0009 0.0013 8.3460 11.1493 128.6211 134.6764
frequency: -10.9293 128.6186 134.6720 303.4794 347.2955 364.5869 455.5663 511.4413 529.0033 583.3185 621.7145 759.9972 797.1333 886.9757 1003.8992 1009.6982 1174.3338 1221.9850 1324.7004 1730.5697 3215.0715
redmass: 11.1395 16.1699 15.2160 16.2836 16.9520 10.3144 16.5985 10.6361 12.1560 3.4704 14.3148 1.5960 7.8582 5.9237 7.1668 10.5638 4.6740 4.1625 2.1865 9.9138 1.0926
irintensity: 0.8290 2.7116 1.4235 1.4318 2.7444 2.8486 3.2560 0.8116 9.9392 0.0049 17.1833 22.2633 36.0633 98.9202 147.9419 319.6781 295.3409 68.8759 119.2762 345.5210 16.0524
temp: 298.150 k
press: 1.00000 atm
elementType: 9 9 9 9 9 6 6 6 1
symmnumber: 1
zpe: 102305.0 jmol-1
zpe.correction: 0.038966 hartree
zpe.thermalcorrener: 0.045616 hartree
zpe.thermalcorrenthalpy: 0.046560 hartree
zpe.thermalcorrgfe: 0.007389 hartree
zpe.sumelectzpe: -613.482057 hartree
zpe.sumelectthermal: -613.475406 hartree
zpe.sumelectthermalent: -613.474462 hartree
zpe.sumelectthermalfe: -613.513633 hartree
dipole: 1.4688 1.8368 -0.0069
dipole: 2.3519
quadrupole: -47.8185 -41.9031 -43.6221
quadrupole: 0.2516 0.0046 0.0054
quadrupole: -3.3706 2.5448 0.8258 0.2516 0.0046 0.0054
hfenergy: -613.5210226 hartree
pointgroup: C01 [X(C3H1F5)]
dipole: -0.5937489 -0.7095609 -0.012079 debye
dipolederiv: -0.6399441 0.3047271 0.0055905 0.1973801 -0.574412 -0.0055998 0.0023527 -0.0051114 -0.2935796 -0.4409558 -0.0672765 0.0819518 -0.1911746 -0.4598522 0.2671737 0.0887184 0.2282882 -0.64039 -0.4440835 -0.0630983 -0.0854459 -0.1885275 -0.4414235 -0.2611684 -0.0974132 -0.2210285 -0.6605055 -0.9818848 -0.1710149 -0.0050641 -0.2903699 -0.3512916 -0.0036193 -0.0047833 -0.0028097 -0.0951348 -0.3124789 0.0892876 -0.0000207 0.2598222 -0.8572143 -0.0062783 0.00216 -0.0079064 -0.08466 1.8800169 -0.149686 -0.0003378 0.3079698 1.4556037 -0.0008166 0.0066548 -0.0021836 1.6603949 -0.8476504 0.0817983 -0.0009612 0.1122704 -0.3090374 0.0012082 0.0021565 -0.0001025 -0.4078082 1.6985136 -0.0205181 0.0048815 -0.1651275 1.4452548 0.0103082 0.0012613 0.0114921 0.2961955 0.088467 -0.0042192 -0.0005941 -0.042243 0.0923726 -0.0012077 -0.0011072 -0.0006382 0.2254878 unknown
polarizability: 46.1930666|-3.6940708|34.9820121|0.0704706|0.1027408|23.4544081 unknown
InChI: InChI=1S/C3HF5/c4-2(5)1-3(6,7)8/h1H
charge 0 multiplicity 1
9 atoms
F  2.114103 -1.066065 -0.014141
F  1.303727 0.753513 -1.110067
F  1.302867 0.709419 1.151048
F  -2.641033 -0.68394 -0.016825
F  -1.53599 1.278987 0.005667
C  1.088448 -0.096239 0.003555
C  -0.245861 -0.766797 -0.009546
C  -1.406984 -0.086036 -0.007856
H  -0.262679 -1.857141 -0.018634
