program: Gaussian 09
title: 000069632
version: EM64L-G09RevD.01
frameworkgroup: C1[X(C2H4BrNO)]
method: RPBEPBE
basis: SDD
operation: Freq
keyword: #p
keyword: freq=noraman
keyword: PBEPBE/SDD
title: #p freq=noraman PBEPBE/SDD
converged: YES YES NO NO
title: Mulliken charges:
elementType: Br O N C C H H H H
charge: -0.034471 -0.248272 -0.586879 -0.700350 0.266447 0.311894 0.311898 0.335873 0.343859
chargesum: 0.00000
title: Mulliken charges with hydrogens summed into heavy atoms:
elementType: Br O N C C
charge: -0.034471 -0.248272 0.092853 -0.076558 0.266447
polarizability: 7.13556221e+01 7.86371477e+00 4.53297382e+01 4.25193349e-04 -1.09118582e-03 2.20730937e+01
1716.lowfreq: -19.0890 -0.0006 -0.0005 0.0005 4.6751 4.7011 55.3483 192.4651 325.6204
frequency: 55.3404 192.4625 325.6194 485.3273 497.1720 604.7066 630.9264 661.2021 846.1571 871.0695 1064.1245 1145.0405 1229.2714 1368.0538 1413.4372 1578.8767 1644.1325 3071.8121 3154.4517 3503.9210 3659.3173
redmass: 3.3500 6.3602 9.5226 1.6508 2.9224 1.1442 5.5212 1.4213 3.9249 1.7494 1.8161 1.1318 1.1930 3.7339 1.1185 1.5762 3.1984 1.0567 1.1087 1.0459 1.1038
irintensity: 15.1188 14.5176 7.0691 8.1027 9.3088 160.6411 84.4440 150.0232 3.4213 16.2290 2.5827 0.0065 38.0859 128.6866 8.3268 79.6303 286.8006 1.7698 0.0572 35.9234 68.6650
temp: 298.150 k
press: 1.00000 atm
elementType: 35 8 7 6 6 1 1 1 1
symmnumber: 1
zpe: 167491.7 jmol-1
zpe.correction: 0.063794 hartree
zpe.thermalcorrener: 0.069516 hartree
zpe.thermalcorrenthalpy: 0.070461 hartree
zpe.thermalcorrgfe: 0.032828 hartree
zpe.sumelectzpe: -221.663233 hartree
zpe.sumelectthermal: -221.657510 hartree
zpe.sumelectthermalent: -221.656566 hartree
zpe.sumelectthermalfe: -221.694199 hartree
dipole: 0.9403 2.0047 0.0012
dipole: 2.2143
quadrupole: -49.7389 -32.7478 -39.5958
quadrupole: -6.1770 -0.0018 -0.0026
quadrupole: -9.0448 7.9464 1.0984 -6.1770 -0.0018 -0.0026
hfenergy: -221.7270269 hartree
pointgroup: C01 [X(C2H4Br1N1O1)]
dipole: 0.058936 0.3961135 0.7736481 debye
dipolederiv: -0.4743127 0.1558518 0.0921626 0.2374178 -0.2665808 -0.1108917 0.2448462 -0.1585903 -0.2867107 -0.8217337 0.3171964 0.3257719 0.1156075 -0.5612575 -0.2999274 -0.051267 -0.182007 -0.7344445 -0.5233969 -0.2047502 -0.2923767 -0.1666129 -0.6571709 -0.0590135 -0.2211459 -0.0812514 -0.9581267 0.2093305 -0.2024256 -0.3065513 -0.3295771 0.3084592 0.2238916 -0.5444416 0.2981787 0.3256541 1.0098004 -0.2337562 0.0256529 0.0182417 0.4701504 0.4816772 0.4969884 0.3344783 1.1323496 0.0537486 0.0419557 0.0766936 0.0704893 0.0554422 -0.0127536 0.0277094 0.025809 -0.0292202 0.0258426 0.0328089 0.0563549 -0.0312021 -0.0137228 -0.0568548 0.0391331 -0.0747835 0.0678495 0.3224525 0.0290643 0.0210298 0.0243205 0.3291413 -0.0797121 0.0121066 -0.0770133 0.2424998 0.1982686 0.0640549 0.0012622 0.0613155 0.3355388 -0.0864158 -0.0039292 -0.0848204 0.240149 unknown
polarizability: 55.9260378|-15.1350412|35.4652608|-8.5265226|16.1958559|47.3671555 unknown
InChI: InChI=1S/C2H4BrNO/c3-1-2(4)5/h1,4H2
charge 0 multiplicity 1
9 atoms
Br -1.742651 1.498803 0.62401
O  1.459244 -0.512123 -1.264812
N  1.312125 0.622584 0.768608
C  -0.671565 0.432564 -0.744806
C  0.797625 0.151895 -0.411059
H  -0.729408 1.01064 -1.678912
H  -1.207678 -0.520961 -0.860418
H  0.737386 1.152897 1.424316
H  2.290121 0.432802 0.985373
