program: Gaussian 09
title: 000069651
version: EM64L-G09RevD.01
frameworkgroup: C1[X(C10H18O4)]
method: RPBEPBE
basis: SDD
operation: Freq
keyword: #pfreq=noraman
keyword: PBEPBE/SDD
title: #p freq=noraman PBEPBE/SDD
converged: YES YES NO NO
title: Mulliken charges:
elementType: O O O O C C C C C C C C C C H H H H H H H H H H H H H H H H H H
charge: -0.256112 -0.256078 -0.207689 -0.207726 0.333999 0.334014 -0.709418 -0.695416 -0.709392 -0.709435 -0.695455 -0.709463 0.161191 0.161314 0.226317 0.214931 0.265481 0.233706 0.233697 0.201968 0.265447 0.214942 0.226305 0.226323 0.214937 0.265478 0.233706 0.233695 0.201979 0.265534 0.214932 0.226287
chargesum: 0.00000
title: Mulliken charges with hydrogens summed into heavy atoms:
elementType: O O O O C C C C C C C C C C
charge: -0.256112 -0.256078 -0.207689 -0.207726 0.333999 0.334014 -0.002689 -0.026045 -0.002698 -0.002696 -0.026075 -0.002711 0.161191 0.161314
polarizability: 1.56166552e+02 -4.15379151e+00 1.15572486e+02 1.64062822e-03 6.11970684e-04 9.91902942e+01
1716.lowfreq: -22.4672 -16.1733 0.0005 0.0007 0.0008 6.7142 9.0489 42.2940 81.3241
frequency: -22.4667 42.2940 81.1979 82.3667 100.3055 112.7651 169.9868 170.0340 174.1407 205.8515 236.0957 236.4442 241.6940 242.1660 253.8791 298.2119 308.9262 324.3432 338.8046 391.7379 398.9947 411.7120 426.2150 443.2206 466.5071 506.4511 515.1661 657.2733 738.4691 753.2031 764.4594 802.9780 805.4662 865.7641 917.3558 917.4005 923.4006 925.9654 958.0814 958.1019 1031.5448 1031.5805 1034.0426 1034.5735 1097.7750 1165.4202 1184.1786 1215.6214 1256.7411 1256.7978 1269.7858 1271.3614 1379.4985 1379.5423 1382.8090 1383.1172 1405.5017 1405.8239 1446.1797 1446.1917 1467.2093 1467.2769 1467.7431 1468.2858 1472.7878 1473.1573 1477.8814 1477.9597 1500.8730 1501.1351 1619.9402 1624.1516 2991.2544 2991.2910 2992.8755 2992.9122 2998.1210 2998.3590 3083.4854 3083.6230 3086.1851 3086.3052 3098.6237 3098.7817 3104.6074 3104.6653 3113.2180 3113.2342 3116.4533 3116.4838
redmass: 3.6873 3.5301 5.1948 4.0682 3.6426 3.2226 1.0975 1.0986 3.9072 3.6675 1.0661 1.0699 1.0650 1.0724 3.6998 3.1535 3.6010 2.7701 2.5725 2.9563 2.5023 2.9864 2.6789 3.0216 2.3860 7.9990 7.7298 5.4142 6.2736 9.4627 12.2086 3.0759 4.0333 6.0422 1.5845 1.5850 1.5993 1.6829 1.2025 1.2024 1.4260 1.4256 1.4132 1.4231 7.5375 2.5720 2.2402 4.9397 3.0277 3.0265 3.1259 3.2034 1.2191 1.2190 1.2311 1.2326 1.2130 1.2141 1.0460 1.0462 1.0479 1.0479 1.0555 1.0560 1.0685 1.0675 1.0533 1.0537 1.0562 1.0560 11.1084 10.9927 1.0363 1.0363 1.0361 1.0361 1.0364 1.0364 1.0991 1.0991 1.0990 1.0990 1.0992 1.0991 1.1005 1.1006 1.1005 1.1005 1.0998 1.0998
irintensity: 1.1775 2.7574 0.0150 3.2309 0.1047 0.0000 0.0164 0.0153 0.0000 0.0000 1.1336 0.0003 0.3206 0.0004 9.0181 0.0001 22.4753 1.2825 0.0000 0.0000 0.1146 0.3427 12.6926 0.0000 0.0000 0.0297 29.8483 8.9631 0.0001 40.3041 0.0002 12.6055 0.0001 0.0000 0.0781 1.7448 2.4524 0.0000 0.0995 0.1331 0.0558 0.0121 0.3806 0.0000 1096.9595 0.0002 25.0292 0.0001 1.8637 54.5375 40.5293 0.0015 8.3110 75.5264 80.0760 0.0218 37.8121 0.0075 0.2857 2.0290 4.0943 0.0013 0.0022 1.3289 46.5399 0.0375 8.9263 0.2840 44.9699 0.0395 332.3763 0.0033 0.0005 42.9306 15.1374 0.0137 53.1267 0.0008 0.0041 19.7808 31.1703 0.0132 102.5123 0.0001 0.0568 44.5018 4.4233 9.4939 32.9329 2.6645
temp: 298.150 k
press: 1.00000 atm
elementType: 8 8 8 8 6 6 6 6 6 6 6 6 6 6 1 1 1 1 1 1 1 1 1 1 1 1 1 1 1 1 1 1
symmnumber: 1
zpe: 696432.3 jmol-1
zpe.correction: 0.265257 hartree
zpe.thermalcorrener: 0.281838 hartree
zpe.thermalcorrenthalpy: 0.282782 hartree
zpe.thermalcorrgfe: 0.222449 hartree
zpe.sumelectzpe: -691.637816 hartree
zpe.sumelectthermal: -691.621235 hartree
zpe.sumelectthermalent: -691.620291 hartree
zpe.sumelectthermalfe: -691.680624 hartree
dipole: -0.0009 0.0008 -0.0034
dipole: 0.0036
quadrupole: -60.4057 -94.8954 -81.9351
quadrupole: -0.2853 0.0025 -0.0005
quadrupole: 18.6730 -15.8167 -2.8564 -0.2853 0.0025 -0.0005
hfenergy: -691.9030728 hartree
pointgroup: C01 [X(C10H18O4)]
dipole: -0.0003493 -0.0003199 0.0013358 debye
polarizability: 156.3357062|3.2184958|115.4033294|-0.0017487|-0.0059699|99.1902963 unknown
InChI: InChI=1S/C10H18O4/c1-9(2,3)13-7(11)8(12)14-10(4,5)6/h1-6H3
charge 0 multiplicity 1
32 atoms
O  -1.714564 -0.484891 0.000331
O  1.715002 0.485376 0.000363
O  -0.735568 1.651351 -0.00309
O  0.736061 -1.650826 -0.001734
C  -3.169189 0.011069 -0.00006
C  3.169462 -0.011049 0.000053
C  -3.419935 0.823574 -1.285367
C  -3.948595 -1.313281 0.00127
C  -3.419752 0.826064 1.283728
C  3.419912 -0.823851 -1.285117
C  3.949368 1.31302 0.001323
C  3.419365 -0.826059 1.283931
C  -0.665166 0.402884 -0.00128
C  0.66559 -0.402364 -0.000563
H  -3.151211 0.229839 -2.176787
H  -4.494793 1.073116 -1.350736
H  -2.841402 1.760705 -1.2882
H  -3.69981 -1.909389 0.89557
H  -3.700725 -1.910665 -0.892432
H  -5.0344 -1.109303 0.001688
H  -2.840546 1.762792 1.285038
H  -4.494426 1.076597 1.348356
H  -3.151718 0.233756 2.176303
H  3.151448 -0.230144 -2.176634
H  4.494671 -1.073839 -1.35042
H  2.840978 -1.760737 -1.287827
H  3.700665 1.909348 0.895499
H  3.701869 1.91038 -0.892498
H  5.035097 1.108636 0.001943
H  2.839505 -1.762396 1.285266
H  4.493861 -1.077322 1.348659
H  3.151646 -0.233489 2.176424
