program: Gaussian 09
title: 000004357
version: EM64L-G09RevD.01
frameworkgroup: C1[X(C13H17IN2O)]
method: RPBEPBE
basis: SDD
operation: Freq
keyword: #p
keyword: freq=noraman
keyword: PBEPBE/SDD
title: #p freq=noraman PBEPBE/SDD
converged: YES YES NO NO
title: Mulliken charges:
elementType: I O N N C C C C C C C C C C C C C H H H H H H H H H H H H H H H H H
charge: 0.081360 -0.296697 -0.451868 -0.498158 -0.023482 -0.455217 -0.420661 -0.407801 -0.402576 -0.376919 0.281501 0.483902 -0.442186 -0.326806 -0.134439 -0.143076 -0.373206 0.257149 0.216823 0.204975 0.194922 0.245473 0.173760 0.211790 0.207260 0.196218 0.195764 0.203080 0.283292 0.287512 0.221172 0.315441 0.245991 0.245709
chargesum: 0.00000
title: Mulliken charges with hydrogens summed into heavy atoms:
elementType: I O N N C C C C C C C C C C C C C
charge: 0.081360 -0.296697 -0.168576 -0.210647 0.233667 -0.033419 0.019734 -0.022251 0.000902 0.021924 0.281501 0.483902 -0.221014 -0.011365 0.111552 0.102633 -0.373206
polarizability: 3.11788104e+02 4.86201825e+00 1.52037963e+02 -8.66352609e+00 3.31793231e+00 1.00513166e+02
1716.lowfreq: -22.4685 -6.7558 -3.7224 -0.0007 -0.0004 -0.0002 9.4181 25.1292 45.9169
frequency: 8.6774 23.8173 45.7494 53.6440 72.2458 100.4637 123.5832 161.9884 178.9439 202.5703 255.6769 267.1086 291.0437 337.8126 348.4706 358.5238 385.5561 407.5798 414.1407 461.9564 477.6119 507.9867 579.5984 608.8948 618.7259 636.1126 700.7913 707.1796 737.8469 768.0161 795.6109 811.0567 815.1606 843.0010 847.3050 860.3763 873.5315 918.3434 937.2892 964.4980 982.7191 983.9735 1007.2078 1029.6442 1046.0192 1054.2681 1061.3267 1085.8402 1112.5315 1116.4778 1147.7106 1155.6750 1188.3868 1203.2366 1240.5975 1256.6190 1264.5524 1275.1287 1292.7328 1300.9261 1322.8979 1328.2410 1331.5174 1346.1786 1351.2305 1356.4724 1368.9971 1395.8604 1451.8990 1457.5142 1458.2148 1462.1797 1470.3666 1472.5832 1483.2442 1497.1849 1583.9278 1603.0114 1639.6601 2943.0980 2966.2678 2968.2741 2978.2829 2983.0463 3026.4551 3029.0820 3032.5589 3038.0303 3044.3507 3056.8830 3111.8283 3162.3443 3167.4336 3192.9133 3526.3283 3546.5080
redmass: 4.8233 3.8876 4.5954 4.6479 7.2657 5.0011 4.7862 5.4169 4.3136 2.4001 4.4006 3.1298 2.9861 2.2813 1.6058 5.7918 2.3810 2.9771 2.8406 2.2231 2.4987 2.6266 1.2287 4.4462 5.2622 3.5029 3.6897 7.8907 5.8952 1.5156 3.4357 1.4396 2.8780 2.1013 1.3915 2.3723 2.3973 1.4106 1.3568 2.8053 5.5352 1.3201 2.9608 2.5730 1.4983 2.0450 2.0892 1.7102 1.0515 1.3632 2.1273 1.9395 1.1092 1.6940 1.3562 1.2770 1.6787 1.4826 1.4271 1.6904 1.5159 1.3773 1.4100 1.6201 1.6238 2.2323 1.4669 4.5530 1.1811 1.2943 1.1956 1.1005 1.1267 1.8879 1.2941 2.3954 5.8012 5.9613 4.3471 1.0683 1.0662 1.0607 1.0636 1.0622 1.0902 1.0916 1.0933 1.1002 1.1017 1.0991 1.0901 1.0908 1.0946 1.0952 1.0763 1.0769
irintensity: 0.0795 1.0302 0.2684 1.6631 9.6184 2.1664 1.9973 1.2167 0.8517 0.5798 2.2924 16.4197 3.3754 5.6681 8.2197 7.1201 7.0875 0.0125 0.4224 3.0277 0.6045 70.4340 118.0486 2.9065 2.9555 6.0415 4.8994 8.3708 11.1226 0.8476 5.2171 45.0838 4.7202 2.1190 51.1980 10.1109 6.5093 11.4965 1.0094 12.1689 42.2649 3.0691 11.9817 1.5773 3.7760 4.8097 7.5192 1.9901 1.1237 12.1833 13.4595 4.2897 14.4056 226.8675 64.2873 24.9483 65.7323 10.6045 6.8288 25.6722 5.5544 4.4559 1.2966 15.1304 25.4934 85.1552 31.2089 11.6302 149.6873 221.6441 143.2614 16.8624 56.3719 2.0575 1.8844 885.9797 43.4459 36.3485 167.1082 38.3485 28.7994 39.4653 19.9317 32.3084 62.1743 75.6046 27.4514 33.4353 77.9565 52.6787 20.4267 6.9664 4.3402 13.2675 4.7382 34.5962
temp: 298.150 k
press: 1.00000 atm
elementType: 53 8 7 7 6 6 6 6 6 6 6 6 6 6 6 6 6 1 1 1 1 1 1 1 1 1 1 1 1 1 1 1 1 1
symmnumber: 1
zpe: 732526.9 jmol-1
zpe.correction: 0.279005 hartree
zpe.thermalcorrener: 0.295647 hartree
zpe.thermalcorrenthalpy: 0.296591 hartree
zpe.thermalcorrgfe: 0.230379 hartree
zpe.sumelectzpe: -700.574394 hartree
zpe.sumelectthermal: -700.557752 hartree
zpe.sumelectthermalent: -700.556808 hartree
zpe.sumelectthermalfe: -700.623020 hartree
dipole: 5.1215 3.8659 0.2522
dipole: 6.4217
quadrupole: -103.5975 -110.3433 -120.9343
quadrupole: 6.8568 -0.7344 -0.8881
quadrupole: 8.0276 1.2817 -9.3093 6.8568 -0.7344 -0.8881
hfenergy: -700.853399 hartree
pointgroup: C01 [X(C13H17I1N2O1)]
dipole: -1.9784421 -1.5548457 -0.2266253 debye
polarizability: 310.5276778|6.2084571|151.9398508|17.6274721|5.4828366|101.8717038 unknown
InChI: InChI=1S/C13H17IN2O/c14-10-6-8-12(9-7-10)16-13(17)15-11-4-2-1-3-5-11/h6-9,11,15-16H,1-5H2
charge 0 multiplicity 1
34 atoms
I  6.829929 0.192307 0.509968
O  -0.321016 1.622204 -0.257873
N  -1.776651 -0.180957 -0.511998
N  0.52539 -0.588765 -0.310809
C  -2.977648 0.685042 -0.583898
C  -4.103213 -0.04183 -1.359744
C  -3.464944 1.114848 0.827617
C  -4.718503 -1.219724 -0.561121
C  -4.067173 -0.065489 1.624782
C  -5.204172 -0.758079 0.834528
C  -0.510943 0.370698 -0.349826
C  1.912542 -0.356641 -0.127165
C  2.771876 -1.490039 -0.111677
C  2.4737 0.938906 0.039715
C  4.162541 -1.343374 0.066937
C  3.8658 1.08351 0.219978
C  4.704842 -0.050642 0.233193
H  -2.667002 1.591252 -1.135306
H  -3.722085 -0.385441 -2.340814
H  -4.90075 0.698976 -1.56487
H  -4.23492 1.902963 0.698155
H  -2.620787 1.575934 1.371336
H  -3.974588 -2.037212 -0.436867
H  -5.55621 -1.658799 -1.135903
H  -4.445069 0.294796 2.600538
H  -3.271157 -0.805149 1.850624
H  -6.043335 -0.043348 0.705417
H  -5.601888 -1.619211 1.40543
H  -1.914354 -1.192497 -0.521674
H  0.263154 -1.568302 -0.438612
H  2.356571 -2.498295 -0.238915
H  1.818219 1.811239 0.025104
H  4.80591 -2.227817 0.075771
H  4.284736 2.085736 0.347975
