program: Gaussian 09
title: 000078763
version: EM64L-G09RevD.01
frameworkgroup: C1[X(C3H9NO)]
method: RPBEPBE
basis: SDD
operation: Freq
keyword: #pfreq=noraman
keyword: PBEPBE/SDD
title: #p freq=noraman PBEPBE/SDD
converged: YES YES NO NO
title: Mulliken charges:
elementType: O N C C C H H H H H H H H H
charge: -0.457144 -0.281954 -0.034331 -0.680868 -0.696828 0.211892 0.202770 0.216300 0.232365 0.208463 0.219169 0.228719 0.272025 0.359423
chargesum: 0.00000
title: Mulliken charges with hydrogens summed into heavy atoms:
elementType: O N C C C
charge: -0.097721 -0.009930 0.177561 -0.029433 -0.040477
polarizability: 5.29049558e+01 2.57321408e+00 4.56536106e+01 1.22142024e+00 4.38326315e-01 3.89068764e+01
1716.lowfreq: -17.0683 -6.0341 -0.0011 -0.0010 -0.0008 10.3406 123.0519 192.2537 229.4154
frequency: 122.9734 192.2093 229.4102 262.2838 329.2560 349.0284 455.2551 472.7985 751.6650 843.6636 920.1129 928.0096 950.4091 991.3442 1115.8237 1159.3975 1194.6687 1254.0885 1302.0154 1354.3991 1372.4542 1388.9620 1427.1457 1460.8878 1469.1996 1476.9129 1491.6820 2930.6925 2979.1998 2985.2312 3071.9708 3084.8424 3092.2739 3094.7805 3329.3966 3553.2943
redmass: 2.9735 1.0572 1.1847 2.5230 1.4084 1.6739 2.1523 3.4718 2.7999 2.9054 1.7710 1.6468 1.3357 1.4984 1.5945 1.9610 1.8445 1.2904 1.3717 1.2918 1.2376 1.2181 1.1640 1.0618 1.0456 1.0655 1.0514 1.0832 1.0362 1.0354 1.0982 1.1001 1.0997 1.0996 1.0754 1.0682
irintensity: 0.0863 0.4569 4.2228 1.5330 89.3077 34.1130 29.8068 5.3371 21.7292 20.3281 26.2042 8.8405 3.3196 46.6794 14.2169 3.5367 16.2650 62.4876 0.6574 3.0947 29.2756 16.1052 4.6310 8.2349 1.8300 7.9257 17.2807 49.9978 33.6189 18.9072 36.7156 16.0145 29.0281 51.8005 7.7181 14.5946
temp: 298.150 k
press: 1.00000 atm
elementType: 8 7 6 6 6 1 1 1 1 1 1 1 1 1
symmnumber: 1
zpe: 319329.6 jmol-1
zpe.correction: 0.121626 hartree
zpe.thermalcorrener: 0.128440 hartree
zpe.thermalcorrenthalpy: 0.129385 hartree
zpe.thermalcorrgfe: 0.091970 hartree
zpe.sumelectzpe: -249.193683 hartree
zpe.sumelectthermal: -249.186869 hartree
zpe.sumelectthermalent: -249.185924 hartree
zpe.sumelectthermalfe: -249.223339 hartree
dipole: -0.8869 -0.0992 0.2683
dipole: 0.9319
quadrupole: -31.3182 -30.0742 -33.5872
quadrupole: 1.2818 3.4243 1.0799
quadrupole: 0.3417 1.5857 -1.9274 1.2818 3.4243 1.0799
hfenergy: -249.3153091 hartree
pointgroup: C01 [X(C3H9N1O1)]
dipole: -0.3505672 -0.0453073 0.0973075 debye
dipolederiv: -0.7914088 0.0112023 0.0121788 0.021898 -0.4477172 0.0835226 0.1655284 0.128196 -0.0852644 0.147283 0.1633397 -0.0581831 0.0903915 -0.08091 0.088754 -0.1576247 0.1202014 -0.3096581 0.300133 -0.1020688 0.0672822 -0.148638 0.3056279 -0.024362 0.0273839 -0.001771 0.2977836 -0.00297 -0.0100385 -0.0006967 0.0092614 -0.138318 -0.0405048 -0.009297 -0.0488457 0.0568044 -0.123325 -0.0452604 0.0128432 -0.0139225 0.0077839 0.019104 -0.0386188 0.024414 0.0692555 -0.008749 0.0109402 0.0320555 0.037538 0.0028015 -0.0010828 -0.0283112 0.0138762 -0.240993 -0.063525 0.1209748 -0.0945101 0.0878973 0.0291085 0.0315161 -0.1025222 0.0534039 0.0372748 0.0955388 0.0027597 0.0383326 -0.0089084 0.074949 0.0252256 0.0493694 -0.0423043 -0.1527589 -0.0543783 -0.1542378 0.0391267 -0.1004601 0.0119849 0.0095144 0.0387421 0.0164799 0.083805 0.0825593 0.0330078 0.0259182 -0.019947 -0.1812354 -0.0803216 0.0170897 -0.0883326 0.0654075 -0.0870635 0.0603105 -0.0741685 0.0900317 0.0522877 0.0608383 -0.0924372 0.0469314 0.0545418 0.0964359 -0.0150769 0.0102971 -0.0143441 0.0881537 -0.0150882 0.0775621 0.0240576 -0.1403068 0.1026026 -0.0222164 0.0137414 0.0327905 -0.0362505 -0.073086 0.0527789 -0.1741731 0.1896593 0.306867 -0.0536362 -0.0242173 -0.0635883 0.311734 -0.0840295 0.0003567 -0.0721338 0.0744494 unknown
polarizability: 52.7944123|2.5999933|45.678154|1.566519|0.680574|38.9928765 unknown
InChI: InChI=1S/C3H9NO/c1-3(2)4-5/h3-5H,1-2H3
charge 0 multiplicity 1
14 atoms
O  1.996915 -0.092836 -0.164033
N  0.705134 -0.65866 0.374407
C  -0.427519 0.020441 -0.337734
C  -0.536833 1.477808 0.141618
C  -1.700868 -0.794729 -0.025645
H  -0.247929 0.016106 -1.436984
H  -1.381781 1.987633 -0.35529
H  -0.697097 1.508853 1.234958
H  0.388291 2.030533 -0.09719
H  -1.623594 -1.834471 -0.397841
H  -2.576115 -0.327901 -0.510587
H  -1.879433 -0.827034 1.064126
H  0.751976 -1.646279 0.055431
H  2.412752 0.290035 0.651463
