program: Gaussian 09
title: 000080077
version: EM64L-G09RevD.01
frameworkgroup: C1[X(C4H7NO2)]
method: RPBEPBE
basis: SDD
operation: Freq
keyword: #pfreq=noraman
keyword: PBEPBE/SDD
title: #p freq=noraman PBEPBE/SDD
converged: YES YES NO NO
title: Mulliken charges:
elementType: O O N C C C C H H H H H H H
charge: -0.247931 -0.263493 -0.609193 -0.585073 0.278290 0.205720 -0.762309 0.261725 0.270978 0.261139 0.249605 0.242258 0.331466 0.366820
chargesum: 0.00000
title: Mulliken charges with hydrogens summed into heavy atoms:
elementType: O O N C C C C
charge: -0.247931 -0.263493 0.089093 -0.052371 0.278290 0.205720 -0.009308
polarizability: 6.91324834e+01 1.44289863e-01 6.27818238e+01 9.87051636e-01 -2.25783848e-01 3.63925454e+01
1716.lowfreq: -13.1052 -0.0003 0.0004 0.0006 3.6956 13.4870 46.7166 83.2807 146.8707
frequency: 46.6693 83.2559 146.8663 234.6095 338.8754 369.4903 450.5713 509.1415 521.7495 603.6386 659.8468 762.1413 818.1306 854.6284 885.3360 975.7732 1024.1727 1101.2501 1165.0330 1187.6215 1302.3084 1347.3846 1373.9130 1418.1102 1441.6510 1452.7354 1569.3866 1628.3022 1651.4423 2978.5470 2982.7345 3065.2049 3084.4048 3127.0672 3402.0314 3626.7845
redmass: 2.5665 6.0557 1.0965 4.4282 3.0285 5.2556 2.0929 2.9364 2.2594 2.6285 1.6918 1.0921 2.5617 2.9809 2.4080 1.7887 1.8355 1.9095 1.4386 1.7607 2.2237 2.6626 1.2482 1.0927 1.0738 1.0540 1.5802 3.1532 7.0099 1.0633 1.0418 1.0953 1.0917 1.1004 1.0544 1.0965
irintensity: 5.0409 10.5243 0.6878 19.0986 5.5085 2.7237 2.8352 18.8663 16.3729 51.4680 138.1162 111.5929 9.5346 1.8831 2.7379 13.7742 18.0223 1.6067 46.1872 16.5859 137.7629 61.4001 65.9915 44.2232 22.9748 18.1629 225.6238 19.7434 372.4315 0.6151 1.4414 8.5884 5.0147 11.3708 123.3061 72.6478
temp: 298.150 k
press: 1.00000 atm
elementType: 8 8 7 6 6 6 6 1 1 1 1 1 1 1
symmnumber: 1
zpe: 288245.0 jmol-1
zpe.correction: 0.109787 hartree
zpe.thermalcorrener: 0.117554 hartree
zpe.thermalcorrenthalpy: 0.118498 hartree
zpe.thermalcorrgfe: 0.077084 hartree
zpe.sumelectzpe: -361.291184 hartree
zpe.sumelectthermal: -361.283417 hartree
zpe.sumelectthermalent: -361.282473 hartree
zpe.sumelectthermalfe: -361.323887 hartree
dipole: 2.9588 0.1203 0.5534
dipole: 3.0126
quadrupole: -45.5633 -42.7669 -40.5840
quadrupole: -12.6311 -0.7001 -1.3626
quadrupole: -2.5919 0.2045 2.3874 -12.6311 -0.7001 -1.3626
hfenergy: -361.400971 hartree
pointgroup: C01[X(C4H7N1O2)]
dipole: 1.1164401 -0.2004483 0.3437321 debye
dipolederiv: -0.6902787 -0.0082162 0.0711568 -0.0387275 -0.3590273 -0.1511654 0.0202535 -0.1478157 -0.875036 -0.8116782 0.0113006 -0.3898849 0.113527 -0.3991468 -0.0035253 -0.2053721 -0.0643321 -0.9252429 -0.5510609 -0.0162969 0.2984096 -0.0389699 -0.667296 -0.1135085 0.1042238 -0.0864275 -1.0093669 -0.7053714 -0.0050773 -0.2082829 0.0145549 -0.0740266 -0.1757458 -0.2002719 -0.1054897 -0.114498 1.1125777 0.2156451 -0.0535828 0.3354968 0.2332384 0.2732545 0.0629224 0.2283491 0.9413448 1.1766736 -0.2192218 0.212069 -0.3751967 0.3250864 0.2049345 0.0348168 0.2009456 1.4451543 -0.4586823 -0.0526353 0.1713622 -0.1419255 0.0255521 0.0112937 0.2537226 0.0239398 -0.1089742 0.0185752 -0.0174425 0.0339397 -0.0003087 0.1279813 0.0473046 0.0678594 0.0140553 -0.0300256 0.1238545 0.0024143 -0.0021235 0.0040342 -0.0051646 0.0184819 -0.0270168 0.0409318 0.0918329 -0.0094524 -0.0203731 -0.0579695 -0.034935 0.1178261 -0.0365952 -0.1142931 -0.0340898 0.0014812 0.0714163 0.0361242 -0.019261 -0.0073103 0.0271543 0.0987066 -0.0152679 0.096015 0.0424056 0.0851016 -0.0046206 0.0212564 0.0470255 -0.0406183 -0.0941916 -0.0056851 -0.0920104 0.0871155 0.1464066 0.0642101 -0.0375206 0.0795537 0.3488048 -0.0347942 -0.0340396 -0.0355276 0.2121652 0.4919184 0.0141894 -0.0395687 0.0431815 0.3396362 -0.0444499 0.0581478 -0.0385439 0.2416441 unknown
polarizability: 68.6147314|-2.2454608|37.9776529|1.9948771|5.9314762|61.7144682 unknown
InChI: InChI=1S/C4H7NO2/c1-3(6)2-4(5)7/h2,5H2,1H3
charge 0 multiplicity 1
14 atoms
O  0.816514 -0.165718 1.591864
O  -2.162055 -0.472853 -1.481888
N  -1.821181 -0.109283 0.797652
C  0.034427 -1.025281 -0.567637
C  1.091489 -0.4853 0.398312
C  -1.416892 -0.493876 -0.458438
C  2.504102 -0.364663 -0.144223
H  0.351501 -0.886264 -1.614301
H  -0.020793 -2.123507 -0.406968
H  3.21118 -0.14018 0.668744
H  2.543696 0.449997 -0.893601
H  2.80778 -1.291089 -0.666091
H  -2.773574 0.234274 0.917909
H  -1.136694 -0.089356 1.564366
