program: Gaussian 09
title: 000004356
version: EM64L-G09RevD.01
frameworkgroup: C1[X(C17H24N2O5)]
method: RPBEPBE
basis: SDD
operation: Freq
keyword: #p
keyword: freq=noraman
keyword: PBEPBE/SDD
title: #p freq=noraman PBEPBE/SDD
converged: YES YES NO NO
title: Mulliken charges:
elementType: O O O O O N N C C C C C C C C C C C C C C C C C H H H H H H H H H H H H H H H H H H H H H H H H
charge: -0.260740 -0.448376 -0.213490 -0.407033 -0.240395 -0.396422 -0.369160 -0.407964 -0.018125 -0.145630 -0.170113 -0.656337 0.260755 -0.708421 -0.718620 0.131320 0.495965 -0.400611 -0.416681 -0.419368 -0.231192 -0.218284 0.174182 -0.252269 0.234995 0.238832 0.229299 0.291867 0.207511 0.327904 0.269339 0.206539 0.207356 0.214588 0.212739 0.215781 0.215348 0.219118 0.312031 0.222493 0.265331 0.231881 0.261624 0.224016 0.222077 0.390092 0.230189 0.386054
chargesum: 0.00000
title: Mulliken charges with hydrogens summed into heavy atoms:
elementType: O O O O O N N C C C C C C C C C C C C C C C C C
charge: -0.260740 -0.058285 -0.213490 -0.020978 -0.240395 -0.068518 -0.057130 0.065863 0.211174 0.146237 0.037398 -0.180458 0.260755 -0.073737 -0.068371 0.131320 0.495965 0.087213 -0.184800 -0.157743 -0.007176 0.003794 0.174182 -0.022081
polarizability: 2.45061511e+02 4.68219568e+00 1.97165674e+02 2.51583132e+00 -4.48267633e+00 1.75318891e+02
1716.lowfreq: -12.7706 -7.1614 -4.7155 -0.0010 -0.0009 -0.0005 6.0741 17.8777 24.1905
frequency: -7.9610 17.3532 23.7694 27.0852 32.5085 37.8095 44.2637 57.5215 68.7017 69.9803 86.7781 97.3558 109.4610 132.3888 166.9975 173.3385 193.7445 208.6343 219.8513 235.7449 247.2113 276.7060 284.2748 319.0128 349.0282 350.5173 367.1233 382.2115 402.7451 413.1090 435.2157 465.7077 486.9847 505.7683 514.2241 541.7898 565.6988 575.2311 582.0920 612.3467 617.4521 636.3156 639.6903 659.8142 704.3997 722.2436 747.9965 748.6282 770.9210 818.5419 822.9438 855.8783 864.3369 872.2781 899.9102 916.0526 923.8853 935.3066 959.8941 966.4759 977.3926 983.7895 990.2890 994.6903 998.0114 1026.1854 1034.7516 1050.7546 1061.2591 1084.8798 1110.1746 1124.0716 1130.4668 1154.3039 1170.9655 1174.6448 1177.3775 1188.2598 1190.8155 1210.0073 1212.9564 1227.7644 1233.4263 1246.3164 1259.0043 1280.3332 1283.0049 1303.8844 1311.1983 1315.2272 1331.5381 1342.3863 1346.9353 1358.2426 1369.4088 1377.5662 1382.1115 1397.0376 1440.0835 1452.7894 1459.2074 1467.0854 1470.0831 1470.8757 1471.7907 1480.5803 1483.1545 1484.4837 1493.3917 1591.8124 1614.2931 1615.5957 1665.7609 1672.5433 2801.1449 2848.8310 2967.3615 2971.9461 2977.7023 2981.4037 2985.4033 2986.1559 2997.2981 3056.9394 3061.1104 3065.9034 3067.9374 3071.0756 3073.0790 3110.4611 3122.2626 3134.7077 3145.1395 3161.4343 3510.4442 3520.2389 3522.4756 3549.5630
redmass: 4.4858 4.2021 5.6259 4.8421 3.9703 6.1110 6.2806 3.8085 5.7797 6.9701 3.5780 3.8640 5.0972 5.0784 4.4018 3.7594 3.0312 1.2769 2.5288 4.6100 1.3282 5.8259 4.7197 2.4557 1.9094 2.5269 3.4375 2.1183 2.8314 1.9327 3.8407 3.1860 2.8289 1.8776 3.4736 3.3912 3.1652 4.5582 1.3255 3.5214 6.2827 1.5288 1.6952 2.7819 1.9030 4.4875 3.1852 2.5613 3.2917 3.4626 3.2653 1.2510 2.3960 3.1201 2.7094 1.2203 1.5065 1.9173 1.5687 2.1460 1.4145 2.0031 5.9233 1.3190 1.9476 2.4173 2.6766 2.2483 2.1497 1.7232 4.1233 2.1329 2.8869 1.8258 1.1161 1.4189 1.6878 1.1228 1.2052 1.9858 2.1534 2.7937 1.2941 1.3197 1.3412 1.5299 1.4936 1.3158 1.4926 1.6798 1.2745 1.4126 1.4539 1.4588 1.8816 1.2214 6.8435 1.2113 2.1337 1.0826 1.2308 1.0839 1.2517 1.2674 1.0623 1.1800 1.3384 2.1571 1.0568 6.0207 6.0994 6.8048 8.1079 9.0908 1.0805 1.0722 1.0355 1.0362 1.0783 1.0824 1.0776 1.0697 1.0631 1.1021 1.1002 1.0990 1.0980 1.0991 1.0990 1.0874 1.0859 1.0916 1.0960 1.1015 1.0762 1.0641 1.0643 1.0777
irintensity: 0.0552 0.2850 0.9771 0.1318 0.4268 0.6001 1.2398 0.9543 8.8263 0.2275 0.8397 0.3387 1.5237 2.4833 5.6008 6.2032 0.3079 0.2168 1.0047 1.0854 0.0439 5.2846 1.4985 13.3417 27.7861 2.2873 10.2032 13.5777 0.0382 4.6294 66.2899 37.7048 32.0337 11.9965 24.2146 13.0796 12.3927 25.7753 43.0161 37.0737 0.3824 128.2885 145.8720 49.7176 51.8231 8.4679 12.8198 47.5810 22.3511 2.2989 2.9171 1.4890 13.9279 5.4427 5.1092 7.9048 7.6674 35.9480 5.0877 3.6194 0.7494 5.8063 0.0682 0.4044 2.9222 28.3455 54.5457 311.1189 94.5765 8.2230 62.7593 4.8067 14.5485 14.1419 0.8982 2.0585 17.0673 0.6757 1.4833 34.8955 6.6172 25.0960 4.1318 0.4446 8.3057 33.8305 10.7364 3.2228 11.0263 3.5926 0.8602 90.6177 45.9189 1.9130 24.2625 18.8889 0.2584 19.0086 6.4219 8.6198 55.3083 12.6652 32.3645 105.0811 4.4821 15.9037 97.3848 37.0700 37.1242 1.6585 6.9728 98.0392 235.2741 198.0290 99.9281 67.9382 34.3471 23.5275 17.5794 4.0573 25.2695 37.8233 24.9467 0.8526 15.3818 27.4085 5.1064 78.2761 52.2134 10.2427 0.1044 17.4672 31.3973 19.8046 32.5284 31.0786 32.8480 31.9623
temp: 298.150 k
press: 1.00000 atm
elementType: 8 8 8 8 8 7 7 6 6 6 6 6 6 6 6 6 6 6 6 6 6 6 6 6 1 1 1 1 1 1 1 1 1 1 1 1 1 1 1 1 1 1 1 1 1 1 1 1
symmnumber: 1
zpe: 1023992.8 jmol-1
zpe.correction: 0.390018 hartree
zpe.thermalcorrener: 0.415108 hartree
zpe.thermalcorrenthalpy: 0.416052 hartree
zpe.thermalcorrgfe: 0.331311 hartree
zpe.sumelectzpe: -1146.023085 hartree
zpe.sumelectthermal: -1145.997995 hartree
zpe.sumelectthermalent: -1145.997051 hartree
zpe.sumelectthermalfe: -1146.081791 hartree
dipole: -0.0224 0.6875 4.6120
dipole: 4.6630
quadrupole: -130.4466 -153.0469 -142.3805
quadrupole: 12.4252 6.1149 3.0287
quadrupole: 11.5114 -11.0889 -0.4225 12.4252 6.1149 3.0287
hfenergy: -1146.4131029 hartree
pointgroup: C01 [X(C17H24N2O5)]
dipole: 0.0222044 0.2427637 -1.818295 debye
polarizability: 245.3285615|1.3013523|196.8871458|3.7379499|4.4795763|175.3303687 unknown
InChI: InChI=1S/C17H24N2O5/c1-11(2)8-14(17(23)24)19-16(22)13(18-10-15(20)21)9-12-6-4-3-5-7-12/h3-7,11,13-14,18-20,23H,8-10H2,1-2H3
charge 0 multiplicity 1
48 atoms
O  -0.543756 -0.0054 1.988222
O  -0.635702 3.17371 -1.531431
O  0.300479 4.668106 -0.019882
O  -5.813794 0.374331 -0.602526
O  -5.340559 -1.884346 -0.315357
N  -0.224062 1.036115 -0.06075
N  -2.657939 -1.321471 0.161535
C  1.796256 2.188659 0.967462
C  2.795847 1.678524 -0.100671
C  0.29202 2.270129 0.543397
C  -1.219314 -1.229015 -0.068117
C  -0.540132 -2.543683 0.407712
C  -0.631771 -0.025774 0.723088
C  4.191512 1.525973 0.552016
C  2.885795 2.591295 -1.347796
C  0.010987 3.493206 -0.320789
C  0.939003 -2.611134 0.060366
C  -3.505234 -0.234347 -0.299525
C  1.361373 -3.003395 -1.236936
C  1.925575 -2.265113 1.019367
C  2.733855 -3.049599 -1.570106
C  3.299528 -2.312168 0.690545
C  -4.947371 -0.69978 -0.392232
C  3.708968 -2.703511 -0.605283
H  2.096096 3.195734 1.318065
H  1.829532 1.508866 1.839106
H  2.464801 0.67112 -0.426061
H  -0.270181 2.425811 1.48834
H  -0.976143 -1.075193 -1.154634
H  -0.343532 1.004166 -1.074924
H  -0.694022 -2.606633 1.499299
H  -1.079294 -3.389499 -0.064077
H  4.578157 2.507027 0.890077
H  4.152437 0.853616 1.428888
H  4.917548 1.103808 -0.167014
H  3.672391 2.226322 -2.034116
H  1.940367 2.617211 -1.920578
H  3.140627 3.629652 -1.061644
H  -3.077952 -2.252659 0.086575
H  -3.227267 0.148981 -1.3156
H  -3.46669 0.645365 0.374012
H  0.610596 -3.289094 -1.985355
H  1.607969 -1.954601 2.021662
H  3.043004 -3.362153 -2.574195
H  4.049634 -2.048795 1.445256
H  -0.798076 4.010262 -2.045241
H  4.774329 -2.744851 -0.858633
H  -6.747892 0.038627 -0.678318
