program: Gaussian 09
title: 000080083
version: EM64L-G09RevD.01
frameworkgroup: C1[X(C18H18N4)]
method: RPBEPBE
basis: SDD
operation: Freq
keyword: #pfreq=noraman
keyword: PBEPBE/SDD
title: #p freq=noraman PBEPBE/SDD
converged: NO YES NO NO
title: Mulliken charges:
elementType: N N N N C C C C C C C C C C C C C C C C C C H H H H H H H H H H H H H H H H H H
charge: -0.371395 -0.711504 -0.701813 -0.701813 0.330453 0.348035 0.348631 -0.351624 -0.325009 -0.325511 -0.351817 -0.325175 -0.325510 -0.433241 -0.421372 -0.421237 -0.433036 -0.421375 -0.421267 0.509467 0.508363 0.508229 0.243791 0.233845 0.233912 0.243860 0.233941 0.233933 0.206285 0.213538 0.213504 0.206259 0.213545 0.213504 0.293122 0.293137 0.303337 0.303337 0.303334 0.303334
chargesum: 0.00000
title: Mulliken charges with hydrogens summed into heavy atoms:
elementType: N N N N C C C C C C C C C C C C C C C C C C
charge: -0.371395 -0.125245 -0.095139 -0.095144 0.330453 0.348035 0.348631 -0.107832 -0.091164 -0.091599 -0.107957 -0.091233 -0.091577 -0.226956 -0.207833 -0.207733 -0.226777 -0.207830 -0.207763 0.509467 0.508363 0.508229
polarizability: 2.63661944e+02 1.97701929e+00 2.79489221e+02 4.74126582e-03 2.24273971e-02 1.67228548e+02
1716.lowfreq: -42.2996 -6.4931 0.0001 0.0005 0.0008 2.8523 3.8308 7.8583 34.5538
frequency: -42.2726 -2.6274 34.4673 37.3142 51.5813 53.4504 119.0426 139.2280 165.1460 194.8227 236.8514 237.2557 261.5004 294.2117 318.9494 326.9284 335.5587 344.4121 358.9003 365.4019 366.0797 374.7397 389.4643 391.7833 409.5100 414.4970 417.3537 466.8642 495.7847 504.4442 511.6693 562.1628 568.8980 632.6822 634.2533 637.4602 646.8977 706.4256 716.9578 730.5453 799.3177 803.2451 807.3265 807.6360 808.3548 815.3205 821.0198 821.7403 825.3374 896.8123 900.1705 916.5437 933.0824 937.6735 949.3194 950.1163 956.0006 992.0065 997.9550 998.6329 1013.4313 1014.5397 1014.7370 1116.1901 1119.0939 1133.0776 1160.3308 1171.2880 1184.9677 1193.5803 1267.9616 1285.0766 1286.1536 1295.7632 1307.3013 1310.0992 1329.3529 1332.5468 1364.8856 1367.0459 1373.3544 1428.1050 1430.6588 1441.9496 1507.8269 1508.4440 1517.9827 1571.7533 1573.5032 1574.5717 1625.4596 1627.7965 1630.4439 1641.5275 1643.1218 1651.5324 3109.0650 3112.1170 3113.2600 3114.0434 3115.7708 3116.8774 3142.9988 3146.1143 3149.1458 3151.4871 3152.1527 3156.3091 3568.6612 3569.0317 3576.2828 3709.3707 3709.7110 3718.3000
redmass: 3.5540 4.0735 4.5510 5.4186 5.2424 3.5109 4.8616 4.7817 4.6775 1.2053 6.6411 4.5178 4.4507 1.0463 5.3107 1.4753 1.2115 3.2072 3.3695 1.0388 1.0437 6.3491 2.7744 3.0297 2.7901 2.7368 2.7640 4.8198 4.4488 2.9447 2.4317 4.0229 2.6959 6.8709 5.7298 6.8066 6.8735 3.5498 3.4369 3.9109 1.2611 3.7854 1.2834 3.3480 1.4537 1.4605 3.1030 2.5998 2.7294 3.5048 4.7435 1.3622 1.3341 1.4793 1.5911 1.3623 1.3455 2.7403 2.5990 2.6641 1.4398 1.4405 1.4168 1.1995 1.2074 1.2251 1.7172 1.0992 1.2156 1.3750 2.3976 2.3102 1.3912 1.3652 3.1379 1.7900 2.7236 8.0417 4.6567 4.8760 6.2003 3.5440 3.5628 3.6926 3.0989 3.2598 3.1137 6.9839 7.0257 7.1368 3.2161 2.3368 1.3145 1.4154 1.5289 5.0181 1.0890 1.0883 1.0883 1.0886 1.0878 1.0880 1.0956 1.0952 1.0965 1.0964 1.0931 1.0939 1.0447 1.0448 1.0444 1.1040 1.1041 1.1041
irintensity: 0.0196 0.9202 2.6345 2.0109 1.0008 0.0063 1.2671 1.8539 4.1571 318.6492 0.1632 0.0000 8.0073 0.0594 0.1247 88.4091 420.0046 87.7477 1.3083 0.0013 0.0040 14.9352 0.0000 0.6938 0.0038 0.0003 0.0257 15.3001 2.9575 1.5273 9.3587 37.5281 55.6369 0.0009 1.8208 0.2450 1.0438 1.3191 0.2133 21.5743 0.0419 0.0518 4.5321 2.4366 33.9905 40.5939 30.2756 31.8396 50.1524 15.8409 0.5182 0.8064 0.0011 0.7557 0.1131 0.0111 0.1934 0.0245 2.9026 4.2218 0.0032 0.0399 2.1075 0.6206 40.7777 7.4856 8.5143 35.5949 21.9706 0.3599 76.7349 275.9606 0.0541 2.0292 23.0135 34.8686 18.4630 16.9117 0.0178 5.3680 35.6164 0.0000 0.6240 2.1460 704.4549 354.6141 23.8270 0.0343 2.1116 1.3649 27.4520 8.0397 133.1853 386.3579 159.8546 15.0098 17.9391 61.5946 1.3268 22.9894 71.5196 22.4616 0.1678 46.0362 0.1996 0.0887 23.6758 0.7293 104.7683 57.0633 61.6977 19.2185 19.9931 15.4093
temp: 298.150 k
press: 1.00000 atm
elementType: 7 7 7 7 6 6 6 6 6 6 6 6 6 6 6 6 6 6 6 6 6 6 1 1 1 1 1 1 1 1 1 1 1 1 1 1 1 1 1 1
symmnumber: 1
zpe: 841197.6 jmol-1
zpe.correction: 0.320395 hartree
zpe.thermalcorrener: 0.339250 hartree
zpe.thermalcorrenthalpy: 0.340194 hartree
zpe.thermalcorrgfe: 0.273679 hartree
zpe.sumelectzpe: -914.181592 hartree
zpe.sumelectthermal: -914.162738 hartree
zpe.sumelectthermalent: -914.161794 hartree
zpe.sumelectthermalfe: -914.228309 hartree
dipole: -2.5030 0.2877 -0.0030
dipole: 2.5195
quadrupole: -104.3562 -87.7796 -120.9860
quadrupole: 1.9257 -0.0117 0.0092
quadrupole: 0.0177 16.5943 -16.6121 1.9257 -0.0117 0.0092
hfenergy: -914.5019877 hartree
pointgroup: C01[X(C18H18N4)]
dipole: -0.9885638 -0.0727019 0.0011626 debye
polarizability: 263.5265709|-1.3220016|279.6245945|-0.0038178|0.0226029|167.2285478 unknown
InChI: InChI=1S/C18H18N4/c19-13-1-7-16(8-2-13)22(17-9-3-14(20)4-10-17)18-11-5-15(21)6-12-18/h1-12H,19-21H2
charge 0 multiplicity 1
40 atoms
N  0.052378 0.004991 -0.000246
N  5.753631 0.404871 0.000569
N  -2.593144 -5.053434 -0.000005
N  -3.287267 4.634491 0.000495
C  1.472213 0.103976 -0.000008
C  -0.604308 -1.283724 -0.000133
C  -0.777023 1.189809 -0.000028
C  2.29479 -1.059642 0.0004
C  -0.937352 -1.930079 1.216879
C  -1.198078 1.782927 -1.216836
C  2.124125 1.371203 -0.000165
C  -0.935372 -1.931208 -1.217083
C  -1.196894 1.783423 1.216953
C  3.700452 -0.958816 0.000611
C  -1.595966 -3.175204 1.225385
C  -2.028394 2.92072 -1.225212
C  3.529982 1.467598 0.000062
C  -1.593921 -3.176367 -1.225517
C  -2.027191 2.921224 1.225667
C  4.350209 0.306045 0.000438
C  -1.937907 -3.818952 -0.000049
C  -2.460486 3.507735 0.000319
H  1.829645 -2.050396 0.000581
H  -0.671377 -1.445096 2.162901
H  -0.864863 1.341559 -2.162946
H  1.525355 2.287453 -0.00045
H  -0.667847 -1.447074 -2.163102
H  -0.862721 1.342499 2.162933
H  4.301471 -1.877709 0.000915
H  -1.848854 -3.654723 2.179457
H  -2.346611 3.359679 -2.179284
H  3.996503 2.461502 -0.000072
H  -1.845215 -3.656784 -2.17956
H  -2.344476 3.360578 2.179869
H  6.331997 -0.428661 0.001429
H  6.209405 1.31126 0.000992
H  -2.839119 -5.511988 -0.871829
H  -2.840554 -5.511164 0.871845
H  -3.597381 5.052015 0.872462
H  -3.598235 5.051661 -0.871336
