program: Gaussian 09
title: 000080094
version: EM64L-G09RevD.01
frameworkgroup: C1[X(C5H15NO6P2)]
method: RPBEPBE
basis: SDD
operation: Freq
keyword: #p
keyword: freq=noraman
keyword: PBEPBE/SDD
title: #p freq=noraman PBEPBE/SDD
converged: YES YES NO NO
title: Mulliken charges:
elementType: P P O O O O O O N C C C C C H H H H H H H H H H H H H H H
charge: 1.260223 1.208263 -0.698530 -0.710584 -0.694973 -0.778450 -0.610270 -0.597539 0.010329 -0.328004 -0.738601 -0.657416 -0.366735 -0.686669 0.248520 0.207793 0.304207 0.273595 0.279071 0.290346 0.223593 0.260706 0.216340 0.201071 0.229578 0.395738 0.447970 0.390554 0.419876
chargesum: 0.00000
title: Mulliken charges with hydrogens summed into heavy atoms:
elementType: P P O O O O O O N C C C C C
charge: 1.260223 1.208263 -0.302792 -0.262614 -0.304420 -0.358574 -0.610270 -0.597539 0.010329 0.128309 -0.160799 -0.087999 0.117564 -0.039679
polarizability: 1.58863129e+02 -1.19639230e+00 1.34308019e+02 -4.69725260e+00 -2.11997002e+00 1.10490692e+02
1716.lowfreq: -13.9076 -5.0501 -0.0027 -0.0015 -0.0011 8.2043 36.7587 46.3708 59.4741
frequency: 36.4824 46.2497 59.4418 73.6541 79.1849 91.0373 99.8961 121.2116 142.6521 158.4198 189.8201 197.5373 217.8999 220.3579 245.7648 257.9166 280.9354 294.6757 311.7954 326.8130 334.3568 361.5799 368.2401 394.1359 409.7460 453.4029 473.8896 505.9091 613.0724 636.5888 660.4479 696.5231 747.5562 769.5314 839.4574 864.7662 884.7795 894.2879 901.6968 915.5817 966.3270 1008.5669 1043.3993 1049.9204 1051.0089 1078.1098 1104.5771 1120.4355 1160.6998 1197.6909 1243.7393 1251.1786 1278.9746 1303.4129 1303.6537 1315.2799 1355.3690 1367.0982 1390.5998 1402.3935 1410.6655 1429.4414 1469.6116 1477.0580 1480.1006 1493.1230 2924.8339 2953.1915 2974.5456 2986.5978 3005.0324 3012.7890 3045.1768 3062.5021 3079.0375 3083.8284 3093.8480 3100.2729 3576.4507 3602.7267 3610.3556
redmass: 7.6834 6.5356 4.3270 5.2407 2.5773 2.6160 4.0126 4.3055 6.1642 7.2099 1.5548 3.8286 4.1972 1.1620 2.4570 3.0682 3.8044 4.2231 1.3502 5.5876 2.9321 3.3746 3.0752 2.5112 3.1931 3.5945 2.5850 5.5628 6.0854 7.2796 11.9248 6.6854 1.1211 7.2163 2.7127 1.4122 1.2169 1.4714 2.2618 1.9909 1.5265 1.4155 3.3594 3.6905 3.4587 1.1724 2.1867 1.8726 1.9242 1.4937 1.1850 1.0968 1.1337 1.1858 1.1291 1.2227 1.5685 1.4014 1.2476 1.6088 1.1282 1.1705 1.1245 1.0403 1.0438 1.0962 1.0719 1.0671 1.0367 1.0636 1.0602 1.0576 1.0958 1.0975 1.1019 1.0991 1.1038 1.1095 1.0663 1.0660 1.0662
irintensity: 1.2734 0.9579 2.6272 1.5337 2.9267 5.9144 10.2959 3.5536 9.8472 28.3237 47.1380 22.4380 35.3651 1.3346 5.0354 54.2291 3.4449 25.9673 87.3977 3.6534 28.3450 143.8797 42.6099 91.2721 3.0781 9.5443 6.8008 60.4461 38.7488 76.7787 277.4151 100.5662 9.8449 63.4656 5.8297 20.8373 113.1733 30.8610 37.6638 30.5279 10.6162 35.2872 102.8023 41.6241 156.1988 248.7025 4.7143 24.2233 51.1410 79.3252 15.9168 97.0076 50.2010 3.4645 5.9744 0.3977 35.8128 3.3130 26.9789 74.3942 9.1830 18.7770 10.9184 5.9818 9.8709 19.0631 980.6118 61.3004 41.6554 18.3429 18.7018 15.0652 5.4796 5.2380 42.5849 32.5147 3.0491 2.6944 60.0445 45.9048 71.8041
temp: 298.150 k
press: 1.00000 atm
elementType: 15 15 8 8 8 8 8 8 7 6 6 6 6 6 1 1 1 1 1 1 1 1 1 1 1 1 1 1 1
symmnumber: 1
zpe: 574452.3 jmol-1
zpe.correction: 0.218797 hartree
zpe.thermalcorrener: 0.237912 hartree
zpe.thermalcorrenthalpy: 0.238857 hartree
zpe.thermalcorrgfe: 0.171245 hartree
zpe.sumelectzpe: -1386.905064 hartree
zpe.sumelectthermal: -1386.885949 hartree
zpe.sumelectthermalent: -1386.885005 hartree
zpe.sumelectthermalfe: -1386.952616 hartree
dipole: 3.4267 1.6588 3.1162
dipole: 4.9198
quadrupole: -99.7524 -106.5371 -98.9007
quadrupole: -18.9482 4.8735 5.4932
quadrupole: 1.9777 -4.8070 2.8294 -18.9482 4.8735 5.4932
hfenergy: -1387.1238618 hartree
pointgroup: C01 [X(C5H15N1O6P2)]
dipole: -1.5594183 0.2571802 1.1174164 debye
polarizability: 150.7693215|-10.3205853|140.9864033|8.6776172|-4.75113|111.9061157 unknown
InChI: InChI=1S/C5H13NO3P.H2O3P/c1-3-4-6(2)5-10(7,8)9;1-4(2)3/h7-8H,2-5H2,1H3;1-2H
charge 0 multiplicity 1
29 atoms
P  2.453562 -0.143939 -0.159406
P  -1.748043 1.424422 -0.607684
O  2.648185 -1.870208 -0.078481
O  1.534686 -0.006218 -1.590104
O  -2.254579 3.031889 -0.104456
O  -0.18954 1.882663 -1.342777
O  3.807565 0.692979 -0.080629
O  -2.780394 0.745473 -1.614921
N  -0.106841 -0.315221 1.184973
C  -0.436357 -1.757269 1.030508
C  1.278536 0.087956 1.342069
C  -1.138724 0.641929 1.146926
C  -0.930219 -2.163255 -0.378319
C  -1.215883 -3.679129 -0.43993
H  0.481261 -2.325493 1.26331
H  -1.20518 -2.025007 1.786697
H  1.773595 -0.483139 2.148858
H  1.34468 1.162903 1.580691
H  -2.092245 0.230904 1.521751
H  -0.890639 1.576721 1.677322
H  -1.850331 -1.604867 -0.642962
H  -0.159786 -1.891819 -1.122444
H  -0.299489 -4.264431 -0.237335
H  -1.983039 -3.979204 0.299811
H  -1.585254 -3.965946 -1.440198
H  3.28675 -2.241391 -0.737736
H  0.900144 0.800554 -1.628826
H  -3.143322 3.296285 -0.458044
H  -0.1950 2.737158 -1.841365
