program: Gaussian 09
title: 000081485
version: EM64L-G09RevD.01
frameworkgroup: C1[X(C4H4N5O)]
method: RPBEPBE
basis: SDD
operation: Freq
keyword: #p
keyword: freq=noraman
keyword: PBEPBE/SDD
title: #p freq=noraman PBEPBE/SDD
converged: NO YES NO NO
title: Mulliken charges:
elementType: O N N N N N C C C C H H H H
charge: -0.219974 -0.361549 0.004376 -0.593071 0.153058 0.179643 0.165937 0.089490 -0.121198 0.276030 0.373296 0.315397 0.341932 0.396634
chargesum: 1.00000
title: Mulliken charges with hydrogens summed into heavy atoms:
elementType: O N N N N N C C C C
charge: -0.219974 0.011747 0.004376 0.145495 0.153058 0.179643 0.165937 0.089490 0.194198 0.276030
polarizability: 1.01006957e+02 -1.14161150e+01 1.11541116e+02 3.34679387e-03 -8.25254494e-03 3.07546688e+01
1716.lowfreq: -4.0235 0.0007 0.0008 0.0009 6.8601 7.1810 54.8079 143.5575 164.7586
frequency: 54.8020 143.5561 164.7582 193.0011 213.4113 353.8964 422.7310 427.6832 508.9788 539.1797 596.5495 613.7241 637.1990 657.2154 694.1218 738.3029 755.9339 853.7605 900.0895 1034.2453 1064.3951 1075.7673 1218.9926 1239.5295 1311.2807 1331.2299 1377.4382 1463.0755 1530.5173 1578.1349 1651.2777 2126.7325 3253.4675 3503.2342 3546.6640 3646.0390
redmass: 5.4305 8.2593 6.6128 5.5253 7.6134 5.1684 9.8758 1.2958 6.3516 5.4137 2.8101 8.9369 3.2226 4.4462 1.6495 1.3084 5.7607 1.4499 8.0155 2.7960 1.9392 3.7229 2.5352 3.3260 2.9348 3.0300 3.9729 5.3221 4.4733 2.8788 1.5873 13.9727 1.1024 1.0482 1.0835 1.1034
irintensity: 13.1638 11.0545 9.0356 0.3550 11.3078 9.7981 7.7091 20.5198 21.7022 3.5405 24.8359 14.3289 15.3261 27.2120 116.6648 279.1664 0.4022 9.6818 5.2618 5.9154 3.1513 5.7740 11.1252 5.5655 5.4929 61.1928 157.6364 105.8134 8.4780 51.0136 313.2490 171.1271 17.1591 150.3435 137.0178 60.2668
temp: 298.150 k
press: 1.00000 atm
elementType: 8 7 7 7 7 7 6 6 6 6 1 1 1 1
symmnumber: 1
zpe: 247752.1 jmol-1
zpe.correction: 0.094364 hartree
zpe.thermalcorrener: 0.102921 hartree
zpe.thermalcorrenthalpy: 0.103865 hartree
zpe.thermalcorrgfe: 0.060396 hartree
zpe.sumelectzpe: -502.790347 hartree
zpe.sumelectthermal: -502.781790 hartree
zpe.sumelectthermalent: -502.780846 hartree
zpe.sumelectthermalfe: -502.824315 hartree
dipole: 2.4782 -5.8282 0.0139
dipole: 6.3332
quadrupole: -35.0072 -32.8493 -55.1142
quadrupole: -8.4945 0.0414 0.0165
quadrupole: 5.9831 8.1409 -14.1240 -8.4945 0.0414 0.0165
hfenergy: -502.8847111 hartree
pointgroup: C01 [X(C4H4N5O1)]
dipole: -1.3452842 -2.0972866 -0.0057791 debye
dipolederiv: -0.86108 -0.007922 -0.0009622 -0.2777963 -0.6952578 -0.001515 -0.0022295 -0.0010129 -0.3172671 -0.1739813 0.022627 0.0000021 -0.231469 -0.6549235 0.0000966 -0.0004125 0.0004442 -0.150978 -0.1997805 -0.2151198 0.0002514 0.2173538 -0.1182336 0.0000785 -0.0002208 -0.0000028 -0.1694691 -1.2064986 -0.259932 -0.0018074 -0.1926279 -0.2917187 0.0014475 -0.001399 0.0013158 -0.6338701 0.9887277 0.39359 -0.0005133 0.6896698 1.0175214 -0.0005863 -0.0010404 -0.0003294 0.2424016 -0.3454932 -0.1660604 0.0002638 -0.497446 -0.2105196 0.0004252 0.0003752 0.0002103 0.1168906 -0.0608693 0.4831975 -0.0007889 0.5324496 0.4612604 -0.0003118 -0.0003808 -0.0004962 0.1232128 -0.0098722 -0.3880956 0.0005198 -0.5267543 -0.4990231 0.0001901 0.0006032 0.0000465 0.088619 0.1809553 -0.0666678 0.0000806 -0.0616639 0.2140141 -0.000304 0.0002631 -0.0001747 0.0307017 1.7064253 0.1560401 0.0037164 0.3422838 0.9241706 0.0020907 0.0054771 0.0016277 0.3149833 0.2116683 0.0677577 -0.0002475 0.0586449 0.346165 0.0000664 -0.0001735 -0.0000194 0.3565815 0.141045 -0.0350169 0.0000299 -0.0307412 0.1519489 0.0000514 0.000024 -0.0000055 0.1959481 0.2757723 0.0441935 -0.0001722 0.0757497 0.1553514 -0.0008266 -0.000384 -0.0009884 0.4028965 0.352981 -0.0285914 -0.0003725 -0.0976532 0.1992444 -0.0009027 -0.000502 -0.0006153 0.3993491 unknown
polarizability: 105.072493|12.5150542|107.4755243|0.061219|-0.0112619|30.7547245 unknown
InChI: InChI=1S/C4H4N5O/c5-3(10)2-4(9-6)8-1-7-2/h1,7H,5H2
charge 1 multiplicity 1
14 atoms
O  -1.316372 1.694822 0.002944
N  -0.39163 -1.875902 0.001339
N  1.762104 -1.144239 0.001629
N  -2.930318 0.005952 -0.005211
N  1.286444 1.222154 -0.000574
N  1.786425 2.264319 -0.00106
C  -0.49795 -0.498563 -0.000396
C  0.857182 -0.077233 -0.000015
C  0.972123 -2.226252 0.002662
C  -1.645056 0.465774 -0.001024
H  -1.161511 -2.550632 0.00254
H  1.324243 -3.255668 0.004153
H  -3.197621 -0.978197 -0.010684
H  -3.683164 0.699364 -0.004705
