program: Gaussian 09
title: 000081494
version: EM64L-G09RevD.01
frameworkgroup: C1[X(C6H7BrN2O2)]
method: RPBEPBE
basis: SDD
operation: Freq
keyword: #p
keyword: freq=noraman
keyword: PBEPBE/SDD
title: #p freq=noraman PBEPBE/SDD
converged: YES YES NO YES
title: Mulliken charges:
elementType: Br O O N N C C C C C C H H H H H H H
charge: 0.072000 -0.262894 -0.231138 -0.222131 -0.158080 0.255862 0.296143 -0.064948 -0.299143 -0.595831 -0.619036 0.270176 0.253355 0.273634 0.253352 0.244559 0.244644 0.289475
chargesum: 0.00000
title: Mulliken charges with hydrogens summed into heavy atoms:
elementType: Br O O N N C C C C C C
charge: 0.072000 -0.262894 -0.231138 -0.222131 -0.158080 0.255862 0.296143 0.205228 -0.299143 0.184511 0.159642
polarizability: 1.43770491e+02 -8.99752867e+00 1.09447913e+02 3.83454989e-03 -7.34141838e-03 4.75317750e+01
1716.lowfreq: -4.3792 -2.1002 -0.0008 -0.0006 -0.0005 8.2011 70.2670 85.3343 93.4494
frequency: 70.2599 85.3335 93.4434 116.4983 146.3720 160.9132 252.0231 262.9982 305.7783 316.4733 367.3119 393.5984 431.5232 466.6580 510.2049 642.0834 708.2560 724.6601 733.7344 805.2300 893.3090 936.3988 998.6769 1045.7725 1126.9534 1127.9365 1129.7645 1216.7120 1234.8871 1293.0550 1335.1674 1371.2356 1427.7759 1430.1390 1473.2142 1475.0731 1478.9256 1493.1047 1585.8246 1632.6151 1638.3753 2999.8328 3014.2209 3091.1583 3106.6728 3131.4176 3144.5737 3175.4866
redmass: 4.7038 1.1147 1.1134 4.4404 3.5608 8.3985 8.6698 4.4573 7.9774 3.3255 3.9860 8.4974 3.6005 8.1506 6.1391 4.9372 11.6040 8.9430 10.4252 6.8678 1.3613 4.2006 2.7366 2.9525 1.9167 1.2946 1.3070 5.0490 2.6643 6.5653 1.6244 3.3574 1.2934 1.2447 1.0624 1.0430 1.1107 1.0430 8.2810 8.4187 8.9703 1.0343 1.0330 1.1036 1.1023 1.0994 1.1023 1.0946
irintensity: 0.0201 0.6198 0.3624 12.4026 1.9281 0.3217 0.0917 0.1996 0.0102 5.4644 7.4649 22.8201 2.1864 12.6116 21.9222 0.0673 1.2321 16.2767 31.3065 13.5234 18.2453 30.2120 53.7023 9.4486 3.1102 0.5374 0.0059 39.3539 1.3103 107.1824 18.8740 29.3849 95.0565 61.0372 3.5393 19.2236 59.1957 19.9969 284.4246 384.8130 212.1321 51.2959 18.7563 20.7239 15.2374 0.1299 0.9844 1.3293
temp: 298.150 k
press: 1.00000 atm
elementType: 35 8 8 7 7 6 6 6 6 6 6 1 1 1 1 1 1 1
symmnumber: 1
zpe: 338552.9 jmol-1
zpe.correction: 0.128948 hartree
zpe.thermalcorrener: 0.140100 hartree
zpe.thermalcorrenthalpy: 0.141044 hartree
zpe.thermalcorrgfe: 0.090622 hartree
zpe.sumelectzpe: -505.446628 hartree
zpe.sumelectthermal: -505.435476 hartree
zpe.sumelectthermalent: -505.434532 hartree
zpe.sumelectthermalfe: -505.484953 hartree
dipole: 1.1848 -4.3042 0.0007
dipole: 4.4643
quadrupole: -83.1778 -65.6925 -73.1852
quadrupole: 2.8578 0.0008 0.0019
quadrupole: -9.1593 8.3260 0.8333 2.8578 0.0008 0.0019
hfenergy: -505.5755756 hartree
pointgroup: C01 [X(C6H7Br1N2O2)]
dipole: -0.9941171 1.4479164 -0.0140791 debye
dipolederiv: -0.4268293 -0.1461696 -0.0035004 -0.2364061 -0.0841354 -0.0016819 -0.0030119 -0.0008473 0.0278841 -1.3023019 -0.20923 -0.0075694 -0.3318478 -0.600099 -0.0021017 -0.0072 -0.0009429 -0.3656774 -0.8574737 0.318798 -0.0057134 0.4398007 -0.8232455 0.0056487 -0.0061403 0.004642 -0.3438386 -1.1873078 0.1690978 -0.0093471 0.0086644 -0.6420069 0.0017112 -0.0086271 0.0032526 -0.2044294 -1.2763144 0.2379501 -0.0108271 -0.644322 -0.7499106 -0.0035938 -0.0079286 0.0047963 -0.1544591 1.6511587 0.0965017 0.0119378 0.5125053 1.2282222 0.0009951 0.0103817 -0.00272 0.2785425 1.1361923 -0.297217 0.0084959 -0.3754073 1.1871214 -0.0066068 0.0087904 -0.0059433 0.2851166 0.912176 -0.2990703 0.0091528 0.0835201 0.0756692 0.0005467 0.0080827 -0.0029625 0.0147972 0.5370795 0.4382862 0.0051437 0.752312 -0.5144213 0.0077635 0.0036479 0.0048749 -0.2238654 0.0208704 0.0016615 -0.0015433 0.096153 0.366554 0.0003114 -0.0018851 -0.0005685 0.1952103 0.3245011 -0.3527874 0.0018578 -0.3078239 0.271169 -0.0028302 0.0016289 -0.0035158 0.2264122 0.094567 -0.0015209 -0.0005911 -0.0304951 -0.0099444 0.0003859 -0.0004966 0.0006626 0.161317 0.0600929 -0.0741018 0.0929034 -0.0219336 0.0400711 -0.0053988 0.0661082 0.0419771 -0.0331072 0.050855 0.1501522 -0.0015129 0.0135281 0.1170223 0.0002046 -0.0008475 0.001402 0.1311832 0.0630781 -0.0739659 -0.090413 -0.0226395 0.0395582 0.0042948 -0.064208 -0.0441184 -0.0360137 0.082844 0.018969 0.0534016 0.0933777 -0.024809 0.0858146 -0.0159743 0.1193135 -0.048173 0.0833201 0.0213203 -0.050788 0.0953761 -0.0259542 -0.0840235 0.0182434 -0.1190789 -0.0479362 0.0334921 0.0013261 -0.0010874 -0.1243622 0.1491393 -0.0014398 -0.0005637 -0.0002234 0.1370367 unknown
polarizability: 145.6540422|3.5338578|107.5560834|0.8554316|-0.1911248|47.5400541 unknown
InChI: InChI=1S/C6H7BrN2O2/c1-8-3-4(7)5(10)9(2)6(8)11/h3H,1-2H3
charge 0 multiplicity 1
18 atoms
Br 3.138164 1.437969 0.031388
O  -2.531173 -0.707204 -0.011162
O  2.088285 -1.5748 0.033168
N  -0.223658 -1.124439 0.011248
N  -1.049374 1.118323 -0.004885
C  -1.346408 -0.272086 -0.002124
C  1.16168 -0.720827 0.021847
C  0.257148 1.586161 0.005153
C  1.33604 0.736957 0.018008
C  -0.521246 -2.576972 0.014239
C  -2.178625 2.074849 -0.018456
H  0.378402 2.672224 0.002119
H  -1.119069 -2.835806 0.903362
H  0.440525 -3.108838 0.02586
H  -1.101337 -2.843292 -0.884375
H  -2.136726 2.706788 -0.922271
H  -2.154906 2.711095 0.883007
H  -3.110023 1.489797 -0.026426
