program: Gaussian 09
title: 000081488
version: EM64L-G09RevD.01
frameworkgroup: C1[X(C11H14ClNO)]
method: RPBEPBE
basis: SDD
operation: Freq
keyword: #p
keyword: freq=noraman
keyword: PBEPBE/SDD
title: #p freq=noraman PBEPBE/SDD
converged: YES YES NO NO
title: Mulliken charges:
elementType: Cl O N C C C C C C C C C C C H H H H H H H H H H H H H H
charge: -0.067996 -0.248567 -0.458238 -0.542699 -0.334979 0.506032 0.208023 0.534736 -0.686281 -0.466688 -0.363905 -0.245544 -0.394669 -0.798393 0.228894 0.230023 0.223102 0.222114 0.311687 0.205676 0.225108 0.205751 0.248236 0.310846 0.235347 0.244107 0.244102 0.224175
chargesum: 0.00000
title: Mulliken charges with hydrogens summed into heavy atoms:
elementType: Cl O N C C C C C C C C C C C
charge: -0.067996 -0.248567 -0.146551 -0.083781 0.110237 0.506032 0.208023 0.534736 -0.049745 -0.218452 -0.053059 -0.245544 -0.159322 -0.086010
polarizability: 2.22077508e+02 -2.87974837e+00 1.39778662e+02 -7.75046253e-02 -2.41448134e-02 7.38363866e+01
1716.lowfreq: -38.3546 -0.0025 -0.0023 -0.0020 2.0532 3.3759 14.5968 45.0797 55.3713
frequency: -37.9599 44.9285 55.3140 76.1390 96.8510 119.9005 151.2892 178.9764 197.1747 209.0199 225.8940 255.5717 297.7058 335.7303 357.1953 394.0493 439.9254 446.1130 532.7591 552.6281 587.0549 644.5671 663.2248 701.2262 718.6589 740.2938 764.0717 844.5753 861.0500 862.0075 873.1803 898.8682 956.1822 983.9466 997.2535 1025.7760 1046.0794 1053.2722 1091.6311 1111.2766 1154.7265 1167.8150 1214.8003 1220.7261 1258.2920 1279.9208 1289.0519 1292.1893 1344.3333 1357.2536 1394.9148 1399.1874 1404.5213 1442.3039 1463.2573 1464.5919 1471.2604 1479.5906 1484.8853 1490.9161 1504.6721 1579.1581 1624.1294 1632.3741 2958.3608 2973.4374 2983.3881 3006.5439 3011.2312 3050.3973 3061.4595 3077.2109 3080.8748 3094.3211 3136.4284 3139.2096 3200.1399 3520.1940
redmass: 1.8414 3.5156 6.0689 4.5140 2.6586 1.1246 2.9487 5.8143 4.7037 4.9492 1.0869 4.2547 5.8285 3.7427 3.5567 7.5859 3.0079 3.7021 6.3708 2.9588 2.9907 1.2862 6.8683 2.7625 5.3086 1.1768 4.4594 1.2739 1.6341 5.4201 1.3486 2.3751 3.5721 1.3174 1.4534 3.0238 1.5094 2.4197 1.5144 2.4519 1.3157 2.3524 1.7217 1.3416 2.3107 1.5858 1.0894 1.7391 2.7709 2.0732 1.2231 2.5985 1.5593 1.1069 1.0448 1.2824 1.0568 1.0421 1.0799 2.0050 2.4900 4.9051 6.5781 5.2210 1.0590 1.0363 1.0371 1.0990 1.0614 1.1002 1.0974 1.0985 1.1028 1.0994 1.0909 1.0924 1.0946 1.0763
irintensity: 0.0495 0.0433 7.5592 0.6075 4.6678 0.1168 0.0101 5.7609 1.6696 2.3124 0.0910 3.2046 6.8371 0.9591 1.9355 3.8324 6.5561 2.1829 10.3935 3.8544 16.9324 53.2375 9.5753 6.6095 7.4982 14.0341 0.2885 6.4547 67.6214 11.8890 0.4928 20.1613 7.9705 5.4250 20.7957 45.1556 8.0109 6.3305 1.1424 4.3769 6.9206 130.6621 9.2134 0.1375 10.7141 3.4928 0.2396 32.1890 103.2265 78.5449 10.7438 35.9291 3.3364 12.4909 14.1546 47.0046 8.3782 13.2282 11.8697 17.8740 443.8954 130.1697 76.1509 89.5683 17.8248 40.9153 27.4121 11.7648 16.2286 2.8668 15.4700 48.1073 74.7858 16.6752 18.7551 1.4862 6.4306 11.5983
temp: 298.150 k
press: 1.00000 atm
elementType: 17 8 7 6 6 6 6 6 6 6 6 6 6 6 1 1 1 1 1 1 1 1 1 1 1 1 1 1
symmnumber: 1
zpe: 592746.2 jmol-1
zpe.correction: 0.225765 hartree
zpe.thermalcorrener: 0.239850 hartree
zpe.thermalcorrenthalpy: 0.240794 hartree
zpe.thermalcorrgfe: 0.183935 hartree
zpe.sumelectzpe: -1016.583945 hartree
zpe.sumelectthermal: -1016.569860 hartree
zpe.sumelectthermalent: -1016.568916 hartree
zpe.sumelectthermalfe: -1016.625775 hartree
dipole: -1.0742 -2.0358 0.0003
dipole: 2.3018
quadrupole: -87.3464 -88.8957 -93.0986
quadrupole: 14.9286 -0.0069 -0.0181
quadrupole: 2.4338 0.8845 -3.3184 14.9286 -0.0069 -0.0181
hfenergy: -1016.8097101 hartree
pointgroup: C01 [X(C11H14Cl1N1O1)]
dipole: 0.4577411 -0.7814014 0.001369 debye
polarizability: 221.660176|6.5156278|140.1956743|-0.1533045|-0.1246682|73.8367055 unknown
InChI: InChI=1S/C11H14ClNO/c1-3-4-11(14)13-9-6-5-8(2)10(12)7-9/h5-7,13H,3-4H2,1-2H3
charge 0 multiplicity 1
28 atoms
Cl -4.003837 -2.096002 0.008276
O  2.132362 1.460221 -0.007204
N  0.959248 -0.573518 0.000148
C  3.412759 -0.652227 -0.005425
C  4.694665 0.203582 0.008229
C  -0.395111 -0.136589 0.000556
C  2.129656 0.195288 -0.004037
C  -3.182901 0.591609 0.002178
C  5.969506 -0.665087 0.002966
C  -1.402642 -1.138382 0.003599
C  -0.777435 1.230817 -0.001708
C  -2.752858 -0.756684 0.004329
C  -2.147561 1.562842 -0.00083
C  -4.64485 0.985247 0.003003
H  3.403502 -1.326658 0.876435
H  3.411473 -1.30934 -0.900359
H  4.686284 0.879419 -0.866289
H  4.680792 0.860206 0.897303
H  1.092952 -1.587987 0.002779
H  6.010325 -1.326564 0.889332
H  6.877065 -0.035081 0.01323
H  6.016534 -1.306392 -0.897802
H  -1.137893 -2.201605 0.00534
H  -0.006733 2.002555 -0.00405
H  -2.432082 2.621429 -0.002566
H  -5.171161 0.583477 -0.88243
H  -5.16943 0.586177 0.890674
H  -4.753532 2.082547 0.001423
