program: Gaussian 09
title: 000000525
version: EM64L-G09RevD.01
frameworkgroup: C1[X(C4H6O5)]
method: RPBEPBE
basis: SDD
operation: Freq
keyword: #p
keyword: freq=noraman
keyword: PBEPBE/SDD
title: #p freq=noraman PBEPBE/SDD
converged: YES YES NO NO
title: Mulliken charges:
elementType: O O O O O C C C C H H H H H H
charge: -0.450836 -0.406142 -0.409408 -0.243074 -0.234277 -0.098186 -0.478818 0.147763 0.222969 0.268158 0.271791 0.266861 0.367644 0.394468 0.381085
chargesum: 0.00000
title: Mulliken charges with hydrogens summed into heavy atoms:
elementType: O O O O O C C C C
charge: -0.083192 -0.011674 -0.028323 -0.243074 -0.234277 0.169973 0.059835 0.147763 0.222969
polarizability: 7.61769318e+01 -2.07169793e-01 5.35207565e+01 -1.40863509e+00 -4.75445688e-01 4.78196694e+01
1716.lowfreq: -4.4334 -3.2223 0.0002 0.0002 0.0009 6.6101 28.5591 54.4835 62.7562
frequency: 28.4679 54.4810 62.7486 141.8734 211.6995 240.9451 316.9347 377.5388 410.5794 467.2722 506.4723 560.4786 591.8874 622.7194 659.7666 683.4111 837.0047 872.9316 919.5668 1023.7102 1044.3124 1084.0626 1092.1027 1204.7587 1222.4693 1254.3933 1289.0060 1310.5338 1352.4149 1391.4791 1427.0138 1645.1945 1669.3565 2962.5535 3021.2122 3107.8469 3490.3340 3514.0032 3518.2417
redmass: 8.2496 8.2845 5.1325 5.5743 6.4451 1.5577 4.3520 2.1502 4.0444 4.0455 2.2851 3.7239 1.6709 2.1239 1.6882 3.2328 5.1725 3.2060 3.4318 3.5534 2.6755 2.4152 2.3122 1.2037 1.1824 1.4091 1.6099 1.4985 1.7810 1.8640 1.1004 9.3324 8.6228 1.0814 1.0626 1.0986 1.0654 1.0639 1.0643
irintensity: 4.8677 6.6004 1.4267 1.5383 4.1219 95.7501 12.8342 41.4638 9.9428 23.1269 27.5968 79.2999 78.1742 60.4640 132.9393 45.1765 24.3663 5.1739 2.0146 161.3382 318.8364 155.9091 32.8248 1.7756 41.0864 30.6223 43.0862 21.9205 52.7707 20.5069 32.9234 242.7677 217.3362 25.2232 2.9393 3.1530 33.1724 26.4877 35.9612
temp: 298.150 k
press: 1.00000 atm
elementType: 8 8 8 8 8 6 6 6 6 1 1 1 1 1 1
symmnumber: 1
zpe: 276288.2 jmol-1
zpe.correction: 0.105233 hartree
zpe.thermalcorrener: 0.114915 hartree
zpe.thermalcorrenthalpy: 0.115859 hartree
zpe.thermalcorrgfe: 0.068673 hartree
zpe.sumelectzpe: -531.442208 hartree
zpe.sumelectthermal: -531.432526 hartree
zpe.sumelectthermalent: -531.431582 hartree
zpe.sumelectthermalfe: -531.478768 hartree
dipole: 0.9718 -2.6524 -0.9695
dipole: 2.9866
quadrupole: -43.8099 -51.5962 -56.3634
quadrupole: -4.5316 4.0946 0.3829
quadrupole: 6.7800 -1.0064 -5.7735 -4.5316 4.0946 0.3829
hfenergy: -531.5474409 hartree
pointgroup: C01 [X(C4H6O5)]
dipole: 0.443256 1.0753152 0.1669888 debye
dipolederiv: -0.2914142 -0.0156034 0.0107206 0.0885863 -0.7503877 0.0440171 -0.0031222 0.0519009 -0.5280485 -0.3487625 -0.2417753 0.1069452 -0.1972226 -1.1306215 0.2460129 0.0961176 0.2324709 -0.4701362 -0.877719 0.1966835 0.5403812 0.138637 -0.4389748 -0.0844766 0.4756827 -0.0901793 -0.7069503 -0.8694375 0.2786781 -0.1593398 0.0353917 -0.7383855 0.1617164 -0.1306024 0.2013066 -0.3937619 -0.7055245 -0.0464986 -0.1832989 0.0239244 -0.3843367 -0.1936043 0.06154 -0.1898859 -0.8984401 -0.0718811 -0.1414857 -0.0269262 -0.1227192 0.5746754 -0.0917771 -0.1979185 -0.1155496 0.36569 -0.3248603 0.0071304 -0.072908 -0.1767496 -0.0346386 -0.0812612 -0.071647 -0.1193022 0.0025013 1.2108968 -0.0711908 0.158359 0.1246337 1.3132661 -0.4097177 0.1749693 -0.4112745 0.3631758 1.4783383 -0.0578075 -0.1738642 0.0118676 0.3498281 0.3647254 -0.2847952 0.3548147 1.311665 0.1231626 -0.0133297 -0.0165353 -0.001505 0.0224164 0.019527 0.0759016 0.0570377 -0.0774116 0.1057237 -0.0114482 -0.0049529 0.0034781 -0.0052158 0.0347305 -0.0157509 0.0561491 0.1021898 0.0606607 0.0210335 -0.0045404 0.0308539 0.1157689 0.021748 0.0012602 -0.0061119 -0.0451936 0.1885336 0.1351488 -0.0265485 0.0482214 0.3844926 -0.0005785 0.0189088 0.0189302 0.3480126 0.1192139 0.000907 -0.0450028 0.0571273 0.3473245 0.0221564 -0.063406 0.0169145 0.3861951 0.2030697 -0.0404423 -0.1024889 -0.064525 0.3747884 -0.0532185 -0.1371379 -0.0572213 0.2405126 unknown
polarizability: 76.1842181|-0.7946128|53.1415876|0.9577646|-1.5869768|48.1915521 unknown
InChI: InChI=1S/C4H6O5/c5-2(4(8)9)1-3(6)7/h2,5-6,8H,1H2
charge 0 multiplicity 1
15 atoms
O  0.303342 -1.680796 0.286595
O  2.096417 1.411165 -0.593608
O  -2.916725 0.598858 0.791431
O  2.833084 -0.619994 0.271451
O  -2.258401 -0.083697 -1.32878
C  0.461354 -0.364634 -0.314385
C  -0.555488 0.600107 0.326851
C  1.907661 0.104991 -0.160581
C  -1.956637 0.314024 -0.183576
H  0.247077 -0.419909 -1.40397
H  -0.30646 1.642381 0.051929
H  -0.530005 0.51165 1.424129
H  1.208011 -2.061446 0.454871
H  3.057362 1.661646 -0.524914
H  -3.824792 0.426454 0.419957
