program: Gaussian 09
title: 000081312
version: EM64L-G09RevD.01
frameworkgroup: C1[X(C7H9O3P)]
method: RPBEPBE
basis: SDD
operation: Freq
keyword: #pfreq=noraman
keyword: PBEPBE/SDD
title: #p freq=noraman PBEPBE/SDD
converged: YES YES NO NO
title: Mulliken charges:
elementType: P O O O C C C C C C C H H H H H H H H H
charge: 1.242181 -0.673174 -0.675739 -0.620099 -0.910047 0.460841 -0.360861 -0.347096 -0.221125 -0.219722 -0.235218 0.298825 0.299066 0.243362 0.242430 0.229311 0.230162 0.231310 0.393480 0.392112
chargesum: 0.00000
title: Mulliken charges with hydrogens summed into heavy atoms:
elementType: P O O O C C C C C C C
charge: 1.242181 -0.279694 -0.283628 -0.620099 -0.312155 0.460841 -0.117499 -0.104666 0.008186 0.010440 -0.003907
polarizability: 1.33268623e+02 1.11502745e+00 1.03673400e+02 1.43206747e+01 -1.95795526e+00 7.23272464e+01
1716.lowfreq: -9.0184 -5.0629 -0.0017 0.0011 0.0014 10.2662 24.5098 35.6369 68.3852
frequency: 23.7237 34.6886 68.3694 104.6648 182.0654 223.9804 235.5381 294.6166 307.0602 334.7600 347.7085 365.4425 401.3521 473.0945 567.7576 616.8360 628.3950 700.4614 706.6385 716.4985 778.0425 810.4147 849.9509 881.0466 924.4349 976.4425 980.1836 990.1673 998.1637 1000.5425 1027.5512 1062.6740 1087.8687 1160.7023 1175.1279 1191.6684 1215.7393 1264.5419 1329.4445 1385.3816 1420.9841 1442.7315 1485.1136 1595.4063 1614.9300 3038.1905 3110.0627 3126.0614 3130.5307 3141.6163 3152.2277 3167.3255 3591.7715 3599.6846
redmass: 4.5690 4.4222 5.1221 2.8463 5.6884 4.0455 2.8843 5.6627 1.2100 1.9061 3.1187 4.3839 2.7930 3.8522 5.5452 6.3045 5.6828 1.7684 5.6089 6.1366 2.0324 4.3636 1.2554 1.7726 1.4374 1.4039 1.8061 5.7639 1.3396 1.2224 2.2049 1.9629 1.7654 1.1699 1.0522 1.1213 2.3289 1.4129 1.2651 8.5238 1.1063 2.1849 2.3308 6.1041 6.1098 1.0592 1.1042 1.0849 1.0881 1.0926 1.0968 1.1018 1.0661 1.0663
irintensity: 0.7796 1.4135 0.5164 33.6227 1.0125 10.9709 38.9199 19.6706 164.9756 12.1270 106.9404 23.4515 0.0998 29.1033 7.7951 0.0635 49.5355 55.1334 144.3922 203.6166 69.6658 5.9899 0.4909 11.2338 3.3868 0.2015 1.1392 0.1284 0.1908 41.2906 6.6052 72.7900 81.6120 20.2429 0.2149 0.2014 1.4073 3.6658 0.5798 0.1771 15.2797 10.3435 16.5546 0.9224 2.5994 3.8717 0.1008 2.2446 0.1158 17.9978 32.3257 16.4643 55.8994 49.0900
temp: 298.150 k
press: 1.00000 atm
elementType: 15 8 8 8 6 6 6 6 6 6 6 1 1 1 1 1 1 1 1 1
symmnumber: 1
zpe: 389027.8 jmol-1
zpe.correction: 0.148173 hartree
zpe.thermalcorrener: 0.159928 hartree
zpe.thermalcorrenthalpy: 0.160872 hartree
zpe.thermalcorrgfe: 0.108758 hartree
zpe.sumelectzpe: -838.220899 hartree
zpe.sumelectthermal: -838.209143 hartree
zpe.sumelectthermalent: -838.208199 hartree
zpe.sumelectthermalfe: -838.260314 hartree
dipole: -0.8610 -1.2006 0.1714
dipole: 1.4873
quadrupole: -61.5939 -73.7404 -72.4327
quadrupole: -2.0449 1.2174 5.5479
quadrupole: 7.6618 -4.4847 -3.1770 -2.0449 1.2174 5.5479
hfenergy: -838.3690716 hartree
pointgroup: C01 [X(C7H9O3P1)]
dipole: -0.334855 0.4738129 -0.0761112 debye
dipolederiv: 2.0730239 -0.0009022 -0.1052564 0.0578634 1.495605 0.2043745 0.0872434 0.1275143 1.5731623 -0.767277 -0.0459522 -0.0121494 -0.0199611 -0.8521684 -0.3718383 -0.1454408 -0.3313683 -0.658605 -1.2620938 -0.0675614 0.3124332 -0.1121194 -0.6500042 -0.0067037 0.3118855 -0.0350195 -0.5847578 -0.7549149 0.0502501 -0.0345037 -0.0199088 -0.6629305 -0.0092033 -0.1197964 0.0748126 -0.6670073 -0.0649851 -0.0008601 0.0087702 0.060361 -0.0810068 0.0515657 -0.0223735 0.0053658 -0.1218974 0.2501542 -0.0048427 -0.0257532 0.001591 -0.0200199 0.0076727 -0.1884121 0.0112771 -0.0899077 -0.1046567 0.0912932 -0.0439384 0.0522483 0.0320198 -0.0185357 0.0036472 -0.0201241 -0.1180301 -0.0814713 -0.0874454 -0.0346353 -0.0567292 0.0313345 0.0155683 0.0075884 0.0030464 -0.1208906 -0.0386628 -0.0982271 -0.0452085 -0.0933733 0.0839615 0.0226851 -0.0354341 0.0362097 -0.1248175 -0.0506743 0.0956782 -0.0499479 0.1043965 0.0818083 -0.0336468 -0.0391668 -0.0482803 -0.1152844 0.0506117 -0.0000154 -0.1026222 -0.0130129 -0.0493834 -0.0013548 -0.087383 -0.0019414 -0.1187023 0.0329085 -0.0118346 -0.0042692 0.0498939 0.0163118 -0.0733963 0.0144857 -0.0502491 0.0486332 0.0327622 0.0166308 -0.0177582 -0.0472929 0.0120083 0.0726774 -0.0031772 0.0499493 0.0498816 0.0519715 -0.090991 0.0501865 -0.0804174 -0.0224695 0.024549 0.0381633 0.0300136 0.1217095 0.0510856 0.0908162 0.0450057 0.0825619 -0.0234204 -0.0218855 0.0327833 -0.0226271 0.1222772 0.0384082 0.0800397 0.0378035 0.0965463 -0.071921 -0.0278007 0.0492642 -0.0273269 0.1419004 0.0380675 -0.0769444 0.0409372 -0.0937106 -0.0638369 0.0362799 0.0542729 0.0367617 0.1384717 -0.0954153 0.0031788 0.0958543 0.0028969 0.0896824 0.0000878 0.0990686 -0.0000149 0.1215278 0.3718089 0.0295466 0.0152201 0.0115191 0.2714935 0.0744936 0.0168132 0.1117446 0.1852228 0.2293491 0.0281426 -0.1301683 0.0166473 0.3829358 0.0544112 -0.0740316 0.0502565 0.2171134 unknown
polarizability: 133.0310588|-1.7478753|103.5938985|-14.7482302|-2.5458015|72.6443112 unknown
InChI: InChI=1S/C7H9O3P/c8-11(9,10)6-7-4-2-1-3-5-7/h1-5,8-9H,6H2
charge 0 multiplicity 1
20 atoms
P  2.231974 -0.124757 0.167236
O  2.081396 1.393045 1.007571
O  3.629272 0.107306 -0.829819
O  2.275498 -1.378866 1.151137
C  0.924948 -0.006854 -1.167383
C  -0.480642 0.010214 -0.604906
C  -1.13921 1.241608 -0.358376
C  -1.150289 -1.204162 -0.307763
C  -2.450564 1.258323 0.166324
C  -2.460393 -1.187451 0.219325
C  -3.115396 0.04368 0.455019
H  1.104614 -0.87393 -1.825073
H  1.165871 0.910091 -1.729245
H  -0.620657 2.183486 -0.571011
H  -0.642536 -2.160578 -0.478823
H  -2.951838 2.215261 0.349172
H  -2.967636 -2.131485 0.446651
H  -4.133043 0.056416 0.860892
H  2.033627 1.28842 1.992124
H  4.497903 -0.039467 -0.377155
