program: Gaussian 09
title: 000081289
version: EM64L-G09RevD.01
frameworkgroup: C1[X(C8H7N3O2)]
method: RPBEPBE
basis: SDD
operation: Freq
keyword: #pfreq=noraman
keyword: PBEPBE/SDD
title: #p freq=noraman PBEPBE/SDD
converged: YES YES NO YES
title: Mulliken charges:
elementType: O O N N N C C C C C C C C H H H H H H H
charge: -0.213988 -0.211696 -0.070509 -0.067701 0.022051 0.290033 0.066440 -0.331559 -0.455086 -0.345728 0.409062 -0.375359 -0.586156 0.280137 0.303472 0.248565 0.283594 0.263954 0.263955 0.226521
chargesum: 0.00000
title: Mulliken charges with hydrogens summed into heavy atoms:
elementType: O O N N N C C C C C C C C
charge: -0.213988 -0.211696 -0.070509 -0.067701 0.022051 0.290033 0.066440 -0.051422 -0.151614 -0.097163 0.409062 -0.091764 0.168273
polarizability: 2.01973418e+02 3.60974479e+00 1.20906586e+02 2.36901053e-03 5.28343158e-03 4.91832767e+01
1716.lowfreq: -25.7378 -4.6808 -2.9528 0.0006 0.0008 0.0011 6.3984 58.8155 90.3729
frequency: -25.4010 58.8122 90.3681 172.2451 173.1134 278.2238 287.0336 323.4977 330.0282 433.3225 447.0071 525.2213 534.1537 569.7270 616.7717 657.4220 683.4150 705.0173 741.2760 770.1588 779.5712 834.9637 840.2775 923.4615 927.2895 973.9933 983.8379 1041.6763 1057.1622 1124.4439 1132.3027 1150.0456 1207.1786 1232.3471 1263.0280 1276.0603 1345.3817 1366.0433 1387.3625 1399.9759 1444.9470 1456.2547 1482.3142 1498.8322 1504.8490 1560.5286 1631.8130 3016.8980 3113.8020 3134.5096 3152.7196 3190.8780 3192.7910 3240.2780
redmass: 1.0589 10.5248 5.2843 3.8899 6.2259 4.8196 4.0808 5.1296 9.8781 2.9055 5.0254 6.1397 5.1526 4.7982 4.5926 7.3529 6.2303 5.1298 1.8430 10.3246 2.0757 3.6801 1.7278 4.9200 1.5015 7.2111 1.3094 1.8219 2.0898 1.3416 1.4231 1.6228 8.9215 1.8001 3.1132 3.0883 3.5727 10.1567 3.5108 2.5104 1.3754 1.0404 1.4770 2.7808 5.2242 7.1750 7.9738 1.0332 1.1023 1.1026 1.0907 1.0932 1.0948 1.0997
irintensity: 0.4003 0.1742 1.2972 4.7373 0.0348 4.3566 6.3854 0.9002 1.1773 10.5597 1.7578 2.6386 2.7556 1.0969 6.3010 6.4268 2.1328 18.0056 19.6967 27.9383 3.9618 2.6525 54.3958 5.0354 26.8162 3.5435 0.9929 15.6321 13.7551 2.3898 23.9771 39.8598 339.6127 0.7978 39.0073 28.1470 19.7147 95.4566 29.7166 13.0329 7.8810 17.6807 2.9403 12.8736 20.1212 0.6948 11.4506 33.2336 9.5345 8.0187 7.3727 2.0038 7.1282 0.1661
temp: 298.150 k
press: 1.00000 atm
elementType: 8 8 7 7 7 6 6 6 6 6 6 6 6 1 1 1 1 1 1 1
symmnumber: 1
zpe: 378406.5 jmol-1
zpe.correction: 0.144127 hartree
zpe.thermalcorrener: 0.153873 hartree
zpe.thermalcorrenthalpy: 0.154817 hartree
zpe.thermalcorrgfe: 0.108266 hartree
zpe.sumelectzpe: -622.733252 hartree
zpe.sumelectthermal: -622.723507 hartree
zpe.sumelectthermalent: -622.722563 hartree
zpe.sumelectthermalfe: -622.769114 hartree
dipole: -8.2896 2.9346 0.0003
dipole: 8.7937
quadrupole: -72.7021 -72.9984 -75.8838
quadrupole: 1.2284 -0.0010 -0.0008
quadrupole: 1.1593 0.8630 -2.0223 1.2284 -0.0010 -0.0008
hfenergy: -622.8773798 hartree
pointgroup: C01 [X(C8H7N3O2)]
dipole: 3.266941 -1.1387597 0.0001137 debye
dipolederiv: -0.9225187 -0.1968306 0.0000632 -0.1953432 -0.5817798 0.0000736 0.000039 0.0000609 -0.2350919 -0.6803348 0.169989 -0.0000087 0.3713686 -0.7622957 0.0000826 -0.0000393 0.0000864 -0.2321811 -0.5748438 -0.2167013 0.0000243 -0.0055044 0.2569153 0.0000034 -0.0001069 -0.0000565 -0.060542 -0.0386128 0.1013925 0.000006 -0.2014576 -0.3828416 -0.0000261 0.0000403 0.0000504 -0.1868504 2.0181487 -0.0585877 -0.0000606 -0.3347506 1.1070194 -0.0001734 -0.0000067 -0.0001562 0.1888425 0.0898917 0.1116173 -0.0000261 -0.1449709 -0.1527128 0.0000054 0.0000153 0.0000097 0.0317054 -0.2344259 0.0618074 -0.0000287 0.2070478 -0.022289 -0.0000012 -0.0000214 -0.0000018 0.0064772 -0.0194195 -0.0874229 0.0000135 0.1789007 -0.038221 0.0000129 0.0000327 -0.0000234 -0.1786102 0.5435819 -0.0948126 0.0000083 0.1748504 -0.068179 -0.0000042 -0.0000413 -0.0000241 -0.0888337 0.0090577 -0.0518182 0.000004 0.0733946 0.1647744 -0.0000133 -0.0000032 -0.0000045 -0.1362104 -0.9342984 0.0481439 0.0000097 -0.0732902 0.1157082 0.0000127 0.0000272 0.0000167 0.0428446 -0.0837057 0.0913247 -0.0000114 -0.1497279 -0.0365855 0.0000021 0.0000346 -0.0000174 -0.1515151 0.5201974 0.1146377 0.0000058 0.0618466 0.184035 -0.0000034 0.0000581 0.0000064 0.1606743 0.0303513 0.0453771 -0.0000067 0.0445905 0.0603455 0.0000051 -0.0000225 0.0000188 0.2225599 0.1190184 0.0113354 -0.0000012 0.0160816 0.0748116 0.0000047 -0.0000006 0.0000122 0.1790327 0.0630187 0.0430037 0.0000014 0.0102755 -0.0726811 0.0000105 -0.0000076 0.0000052 0.1623416 0.0763259 -0.080201 0.0000052 -0.0191916 0.0884125 0.0000032 0.0000006 0.0000113 0.1781567 0.0105126 -0.0137732 -0.010626 -0.0697351 0.0568253 0.0861813 0.0642343 0.0886554 -0.0166085 0.0105366 -0.0137529 0.0106408 -0.0697216 0.0568002 -0.0862007 -0.0642133 -0.0886652 -0.0165736 -0.0024812 0.0152715 -0.0000126 0.1253369 -0.0480619 0.0000246 -0.0000191 0.0000156 0.1303822 unknown
polarizability: 201.9365672|4.0020353|120.9434373|-0.0023434|-0.0052948|49.1832767 unknown
InChI: InChI=1S/C8H7N3O2/c1-10-5-6-2-3-7(11(12)13)4-8(6)9-10/h2-5H,1H3
charge 0 multiplicity 1
20 atoms
O  -3.908079 -0.500331 0.000101
O  -3.229512 1.676932 -0.000289
N  2.929069 0.277791 -0.000118
N  1.924608 1.229593 -0.000273
N  -2.98667 0.407454 -0.000078
C  1.0655 -0.960591 -0.000096
C  0.767433 0.464772 -0.000155
C  2.477829 -1.029252 -0.00014
C  -0.570692 0.937033 -0.00015
C  0.003091 -1.916356 -0.000013
C  -1.572618 -0.039465 -0.000082
C  -1.311559 -1.453562 -0.000007
C  4.32221 0.738907 -0.000047
H  3.161209 -1.874078 -0.000099
H  -0.819384 2.000684 -0.000231
H  0.212572 -2.990615 0.000026
H  -2.164216 -2.136344 0.000049
H  4.509092 1.352348 -0.895978
H  4.508955 1.352522 0.895794
H  4.995764 -0.131243 0.000086
