program: Gaussian 09
title: 000081308
version: EM64L-G09RevD.01
frameworkgroup: C1[X(C12H14ClN)]
method: RPBEPBE
basis: SDD
operation: Freq
keyword: #p
keyword: freq=noraman
keyword: PBEPBE/SDD
title: #p freq=noraman PBEPBE/SDD
converged: YES YES NO NO
title: Mulliken charges:
elementType: Cl N C C C C C C C C C C C C H H H H H H H H H H H H H H
charge: -0.082182 -0.240060 -0.010103 0.321123 0.520727 0.207151 -0.698459 -0.698571 -0.409091 -0.344860 -0.652199 -0.812269 -0.128931 -0.215644 0.219130 0.211753 0.234624 0.211722 0.219061 0.234637 0.262621 0.245458 0.235089 0.234885 0.239003 0.216436 0.228384 0.250565
chargesum: 0.00000
title: Mulliken charges with hydrogens summed into heavy atoms:
elementType: Cl N C C C C C C C C C C C C
charge: -0.082182 -0.240060 -0.010103 0.321123 0.520727 0.207151 -0.032952 -0.033150 -0.146470 -0.099403 0.056777 -0.367449 -0.128931 0.034921
polarizability: 2.22807870e+02 3.32525573e+00 1.46439483e+02 5.43597457e-02 -2.18152406e-02 8.05208024e+01
1716.lowfreq: -127.5785 -0.0019 0.0006 0.0020 1.6973 4.0197 5.2797 47.3124 88.0965
frequency: -127.5544 47.2240 88.0960 119.0545 154.1143 175.4845 212.1315 225.8197 248.3286 257.7662 287.0577 301.6402 303.4771 347.6650 360.1422 367.7987 462.3368 533.6165 544.3337 562.9428 570.9415 613.1967 624.8695 668.5779 691.1224 741.2234 781.5230 798.2460 819.1743 827.3680 883.8146 922.9434 924.4571 938.1513 938.6442 1009.7177 1051.0649 1070.4398 1104.7284 1115.9568 1132.1523 1136.4983 1153.1299 1196.8416 1234.2728 1251.6021 1305.0461 1349.9649 1375.3440 1391.4205 1395.0881 1415.1313 1423.9910 1449.2243 1460.1202 1461.0239 1469.6958 1474.8222 1477.7957 1486.3826 1493.6817 1596.6430 1615.1540 1662.4974 2963.8368 2978.7134 2981.2812 3032.0089 3074.4855 3079.8726 3088.4832 3092.5792 3121.1837 3123.4971 3149.7159 3155.1638 3172.7311 3220.6242
redmass: 1.0524 3.6514 3.9897 3.0005 5.1165 4.2974 1.3950 1.7011 1.5944 1.6479 3.0503 3.9752 2.8853 2.7285 6.1291 4.4804 3.1271 5.6741 3.8544 3.4006 3.8831 3.7578 1.6328 1.8092 5.7062 3.8112 3.6816 1.4889 1.4668 2.4118 1.4088 1.3400 2.5830 1.9861 1.4658 1.2946 2.0585 2.6738 2.5858 1.3173 1.4279 1.7326 4.1757 2.6675 1.9025 2.0440 2.8016 4.6966 1.1793 1.2395 4.3907 1.4071 2.7842 1.2763 1.0489 1.0485 1.0412 1.1696 1.1143 1.0791 2.4337 7.9694 7.6718 6.3405 1.0382 1.0345 1.0349 1.1015 1.1005 1.0996 1.1008 1.1003 1.0648 1.0917 1.0887 1.0924 1.0964 1.1133
irintensity: 0.0192 0.7000 1.8824 0.0735 0.1680 2.3138 0.0552 0.0404 0.5062 0.3147 0.4650 1.9830 1.9928 0.2891 3.3062 0.6860 7.8051 16.4345 4.1893 7.1326 5.1029 13.3225 4.8602 5.7055 0.0259 0.0937 27.7657 39.0094 112.8970 20.4120 14.8508 0.0146 8.0099 6.5242 1.0956 0.0004 1.5142 30.3351 5.0146 0.6824 18.4344 38.7725 3.2569 10.5857 21.3960 23.5256 75.8093 21.3296 14.6180 20.0269 11.4388 10.9983 60.1795 21.9871 6.8068 0.7370 13.7841 38.4024 4.2455 34.0251 171.5380 42.8886 97.6884 194.3718 68.2394 21.5642 31.0633 32.7967 0.4832 47.3252 16.1336 35.1459 1.3754 9.5261 10.0375 2.1289 5.5707 14.1351
temp: 298.150 k
press: 1.00000 atm
elementType: 17 7 6 6 6 6 6 6 6 6 6 6 6 6 1 1 1 1 1 1 1 1 1 1 1 1 1 1
symmnumber: 1
zpe: 594166.6 jmol-1
zpe.correction: 0.226306 hartree
zpe.thermalcorrener: 0.239588 hartree
zpe.thermalcorrenthalpy: 0.240532 hartree
zpe.thermalcorrgfe: 0.186927 hartree
zpe.sumelectzpe: -979.454433 hartree
zpe.sumelectthermal: -979.441150 hartree
zpe.sumelectthermalent: -979.440206 hartree
zpe.sumelectthermalfe: -979.493811 hartree
dipole: -2.8489 1.3453 0.0016
dipole: 3.1506
quadrupole: -98.4244 -77.9028 -94.9281
quadrupole: -1.0330 -0.0039 -0.0002
quadrupole: -8.0060 12.5156 -4.5097 -1.0330 -0.0039 -0.0002
hfenergy: -979.6807388 hartree
pointgroup: C01 [X(C12H14Cl1N1)]
dipole: -1.0806949 0.6070949 0.0002853 debye
polarizability: 222.8955291|-2.0861467|146.3517801|0.0935591|-0.0282338|80.520846 unknown
InChI: InChI=1S/C12H14ClN/c1-8-12(2,3)10-7-9(13)5-6-11(10)14(8)4/h5-7H,1H2,2-4H3
charge 0 multiplicity 1
28 atoms
Cl 4.351364 -0.814157 0.00049
N  -1.297253 1.216475 0.000058
C  -1.09763 -1.182181 -0.000278
C  0.268538 -0.487747 -0.000206
C  -2.074544 0.02765 -0.001842
C  0.079395 0.921284 -0.000255
C  -1.291984 -2.048157 1.276226
C  -1.290703 -2.051093 -1.274881
C  1.558814 -1.031143 0.000097
C  1.172675 1.813281 -0.000379
C  -1.810118 2.582375 -0.000416
C  -3.434695 -0.053241 -0.004317
C  2.652657 -0.131188 0.000232
C  2.481112 1.265359 -0.000054
H  -2.307587 -2.482831 1.294727
H  -0.558751 -2.875412 1.297638
H  -1.15927 -1.442622 2.189363
H  -0.55717 -2.878138 -1.293775
H  -2.306091 -2.486269 -1.29327
H  -1.157465 -1.447636 -2.189309
H  1.730182 -2.112011 0.000172
H  1.035796 2.898755 -0.00101
H  -1.480324 3.131302 -0.90409
H  -1.461498 3.137436 0.892248
H  -2.909421 2.569437 0.011508
H  -4.091619 0.820607 -0.006132
H  -3.922363 -1.030728 -0.004875
H  3.354453 1.924091 -0.000172
