program: Gaussian 09
title: 000081274
version: EM64L-G09RevD.01
frameworkgroup: C1[X(C9H11NO)]
method: RPBEPBE
basis: SDD
operation: Freq
keyword: #p
keyword: freq=noraman
keyword: PBEPBE/SDD
title: #p freq=noraman PBEPBE/SDD
converged: YES YES NO NO
title: Mulliken charges:
elementType: O N C C C C C C C C C H H H H H H H H H H H
charge: -0.279987 -0.362264 -0.668597 0.475373 -0.371600 -0.434926 0.255787 -0.218402 -0.218836 -0.244753 -0.606530 0.256793 0.207209 0.269347 0.225050 0.226651 0.224811 0.228234 0.307340 0.224870 0.276215 0.228217
chargesum: 0.00000
title: Mulliken charges with hydrogens summed into heavy atoms:
elementType: O N C C C C C C C C C
charge: -0.279987 -0.054924 -0.204595 0.475373 -0.102253 -0.209877 0.255787 0.008248 0.005975 -0.016519 0.122771
polarizability: 1.25419189e+02 1.14263786e+00 1.06556923e+02 1.16013368e+01 -3.18890993e+00 7.27492269e+01
1716.lowfreq: -9.6538 -5.6066 -1.9651 -0.0008 -0.0006 -0.0003 16.2712 32.8530 82.3539
frequency: 13.9381 32.7880 82.3526 113.8580 170.5201 225.5039 272.0206 306.0155 405.1071 411.8433 464.2878 513.9287 563.3689 608.9582 623.9149 701.3477 716.1620 757.5758 824.0649 851.5837 855.8592 917.4932 935.6671 977.9368 989.2806 997.2213 1027.2701 1058.1588 1084.6440 1121.0395 1134.9991 1148.2543 1171.7996 1188.8069 1203.7206 1261.4254 1280.1359 1331.2726 1382.0075 1417.1865 1440.0677 1453.3601 1462.6380 1482.9957 1487.5990 1516.0623 1592.2804 1610.8924 1625.2930 2978.7821 3002.2536 3058.9946 3066.0357 3108.8776 3111.1751 3124.7505 3135.8947 3146.7399 3162.8403 3560.1800
redmass: 4.4298 3.7542 3.8146 1.1013 3.5707 4.2935 3.5874 3.4679 2.8251 2.5447 3.2417 4.3960 1.2427 4.5418 4.6038 2.9496 1.9732 2.3130 3.8410 2.5315 1.2849 1.6681 1.8798 1.4017 5.4776 1.3378 2.2308 2.6199 1.7245 1.2948 1.4465 1.5132 1.0538 1.1179 2.5691 1.6956 1.6768 1.2874 8.1177 1.1769 2.1796 1.2715 1.1385 2.1381 1.0458 1.4708 6.2294 6.0057 6.4531 1.0347 1.0600 1.1024 1.1019 1.0983 1.0874 1.0862 1.0916 1.0961 1.1016 1.0777
irintensity: 9.9237 1.1886 2.7907 0.6151 2.6850 3.0891 4.6275 7.5154 0.3967 11.3865 5.2846 35.5752 96.3152 5.3312 6.5937 13.6328 60.6991 30.3742 4.1539 4.5773 1.0770 1.9239 4.0436 0.1775 0.1790 0.2235 8.5989 9.7487 15.6171 0.8704 24.8827 54.7307 0.6510 0.5990 1.0607 32.0971 47.9526 5.9891 0.3574 30.5082 6.8983 81.4845 26.9559 20.5720 15.4399 111.7180 8.3185 31.1709 144.5419 70.1506 26.3111 38.0817 9.1685 1.9709 11.5545 0.2320 19.0425 27.5908 23.2993 15.0279
temp: 298.150 k
press: 1.00000 atm
elementType: 8 7 6 6 6 6 6 6 6 6 6 1 1 1 1 1 1 1 1 1 1 1
symmnumber: 1
zpe: 474146.1 jmol-1
zpe.correction: 0.180593 hartree
zpe.thermalcorrener: 0.191261 hartree
zpe.thermalcorrenthalpy: 0.192206 hartree
zpe.thermalcorrgfe: 0.141865 hartree
zpe.sumelectzpe: -478.734491 hartree
zpe.sumelectthermal: -478.723822 hartree
zpe.sumelectthermalent: -478.722878 hartree
zpe.sumelectthermalfe: -478.773219 hartree
dipole: -0.1049 -3.7415 -0.7945
dipole: 3.8264
quadrupole: -60.7769 -62.7028 -64.9476
quadrupole: -8.3750 -0.7628 -2.1295
quadrupole: 2.0322 0.1063 -2.1385 -8.3750 -0.7628 -2.1295
hfenergy: -478.9150833 hartree
pointgroup: C01 [X(C9H11N1O1)]
dipole: 0.0880792 1.5026181 0.0252074 debye
dipolederiv: -0.6370333 0.1337724 -0.0846278 -0.0496679 -0.9982156 -0.1101032 -0.1541502 0.1008391 -0.4097031 -0.8700793 -0.3199233 -0.1101272 -0.3109313 -0.6117292 -0.1611963 -0.232203 -0.1969078 -0.5469903 -0.3800977 0.0971983 -0.1191618 0.2050513 0.0724403 -0.0368122 -0.0970134 0.0027586 0.0311094 0.3826298 -0.0543751 -0.1261529 -0.0254607 -0.0250125 0.0348941 -0.3254931 0.0528408 -0.0112924 -0.1664027 -0.0707368 0.0039887 -0.1243325 -0.0043156 -0.0087005 0.0551235 -0.0366244 -0.1440016 -0.2020284 0.0249413 -0.051958 0.0406327 0.0036055 -0.1042812 -0.0180796 -0.0983369 -0.0934946 1.0255253 0.1580223 0.3846759 0.311058 1.3622695 0.2656506 0.6667984 0.0613977 0.3676222 -0.0255711 0.0245506 -0.0779491 0.0405132 0.0725362 -0.0986444 -0.0776911 -0.1037922 -0.0586957 -0.015132 -0.0844314 -0.0463801 -0.0824533 0.0733268 -0.0253537 -0.0300856 -0.0369316 -0.104335 -0.0000977 -0.0266744 -0.1136682 -0.0228831 -0.0935618 -0.0149695 -0.0986167 -0.0131262 -0.0977026 0.4246338 0.0824424 0.060353 -0.118668 -0.0177314 -0.0423717 0.0974177 0.0748271 0.3247957 0.0451499 0.0014519 0.020991 0.0119628 0.0060311 -0.1102218 0.0237866 -0.0521874 -0.0047086 0.0088336 -0.020312 0.011741 -0.0683342 -0.0878464 0.1405942 -0.0016285 0.0573599 0.0368715 0.1021793 0.0921934 0.0217145 0.0760952 0.012741 0.0161009 0.0067113 0.012758 0.1251159 0.0655804 -0.0693912 0.0868549 -0.0516012 -0.0240742 0.0975741 0.0701389 0.1087641 0.056257 0.0626088 -0.0440587 0.0669951 -0.056826 -0.0352774 0.1047729 0.0797086 0.1020694 0.0711982 0.0302319 0.1047989 0.027265 0.1206598 -0.0689869 0.0225696 0.0311156 0.0252573 0.1318194 -0.069432 0.0273556 0.1241947 0.0275384 0.0947269 0.0105133 0.1271736 0.0101214 0.081524 0.2303805 0.046738 -0.1255163 0.0740457 0.1166219 0.0325938 -0.1286643 0.0189186 0.229826 -0.1724944 -0.1047861 0.0060401 -0.1140791 0.083529 0.0338126 0.0543422 0.0337537 0.022486 0.1553332 -0.0183312 0.0049216 0.1022428 -0.0037358 0.0675627 0.0133313 -0.0090891 0.1279562 0.0052822 0.0195549 0.0358059 0.0154373 0.0726585 -0.1139842 -0.0620222 -0.1146702 -0.1356575 unknown
polarizability: 124.1084695|-5.2814811|104.8692945|-13.0772913|-8.1528216|75.7475752 unknown
InChI: InChI=1S/C9H11NO/c1-10-9(11)7-8-5-3-2-4-6-8/h2-6,10H,7H2,1H3
charge 0 multiplicity 1
22 atoms
O  2.166614 -1.668973 -0.259979
N  2.65132 0.598856 -0.019471
C  0.754236 -0.048805 -1.461185
C  -0.561956 0.079715 -0.693839
C  -1.066089 -1.016802 0.05368
C  -1.299803 1.289813 -0.716742
C  1.919141 -0.456039 -0.540116
C  -2.282189 -0.90052 0.761643
C  -2.519272 1.406227 -0.00951
C  -3.014352 0.310382 0.732881
C  3.754158 0.398672 0.927612
H  0.673644 -0.845404 -2.222325
H  0.978871 0.897316 -1.987723
H  -0.493262 -1.950989 0.083403
H  -0.925843 2.142551 -1.29811
H  -2.659743 -1.754529 1.335506
H  -3.080119 2.347404 -0.040564
H  -3.959239 0.39748 1.280934
H  2.373274 1.551334 -0.258958
H  4.698011 0.824621 0.540621
H  3.877931 -0.688255 1.059682
H  3.529168 0.854046 1.910162
