program: Gaussian 09
title: 000081273
version: EM64L-G09RevD.01
frameworkgroup: C1[X(C10H18O4)]
method: RPBEPBE
basis: SDD
operation: Freq
keyword: #pfreq=noraman
keyword: PBEPBE/SDD
title: #p freq=noraman PBEPBE/SDD
converged: YES YES NO NO
title: Mulliken charges:
elementType: O O O O C C C C C C C C C C H H H H H H H H H H H H H H H H H H
charge: -0.269225 -0.267261 -0.247442 -0.245704 -0.013485 -0.545655 -0.542569 -0.727632 0.242352 0.241974 -0.224758 -0.227050 -0.673629 -0.672137 0.245482 0.229890 0.291286 0.252461 0.240667 0.198192 0.253050 0.210501 0.227691 0.225750 0.229271 0.226981 0.210263 0.228357 0.230417 0.212095 0.229675 0.230189
chargesum: 0.00000
title: Mulliken charges with hydrogens summed into heavy atoms:
elementType: O O O O C C C C C C C C C C
charge: -0.269225 -0.267261 -0.247442 -0.245704 0.231998 -0.024479 -0.049440 -0.065888 0.242352 0.241974 0.228684 0.229202 -0.004592 -0.000177
polarizability: 1.57990657e+02 1.22538326e+00 1.11881986e+02 -2.79648526e+00 1.69251125e-01 9.97159925e+01
1716.lowfreq: -19.2814 -10.1012 -6.4234 -5.4642 0.0003 0.0006 0.0007 17.9235 43.7533
frequency: -16.7241 17.7837 43.7245 45.2281 58.4989 74.9633 94.8267 112.0531 140.3320 153.3460 185.3992 212.1064 225.2810 247.5344 248.4507 283.0863 298.8176 343.2569 360.4965 378.8573 428.5908 476.1124 550.2333 562.8917 682.0537 698.0081 796.8218 798.2441 800.9768 818.2496 840.7515 870.6948 889.6193 915.9044 934.2684 978.2241 1024.0895 1025.2202 1078.6819 1086.9707 1111.6760 1112.9819 1120.6068 1127.0595 1135.2457 1135.8194 1170.2829 1196.3932 1240.0819 1247.6918 1248.1243 1280.5655 1308.2255 1341.5641 1348.8583 1358.9655 1363.0708 1391.9044 1399.9232 1399.9898 1432.1903 1439.0121 1462.8675 1463.3377 1473.2244 1473.6813 1474.5450 1486.1875 1486.8570 1488.0210 1635.2489 1637.9566 2973.0607 2983.2825 2991.3723 2994.8782 2995.7909 3008.2237 3009.4339 3015.9355 3039.3425 3052.3151 3065.7830 3066.1639 3068.0291 3091.2386 3092.3346 3092.5291 3106.2254 3107.5429
redmass: 3.3991 3.4498 3.0928 3.2054 4.2602 3.1109 3.2102 2.9390 2.5106 2.1906 2.5562 3.1828 1.1827 1.3551 1.2757 4.5613 3.0874 3.7811 3.2066 2.6832 2.5323 3.4621 3.2671 3.3102 5.7605 5.3920 1.1306 1.0971 3.1292 3.4580 3.1523 2.0112 2.1467 2.1472 3.8422 1.7955 2.3379 2.3326 2.2412 2.7278 2.3279 2.2217 2.3504 2.2808 1.4664 1.4894 2.3068 1.4792 1.2898 1.1397 1.1358 1.3356 1.4512 1.5221 1.3954 1.5413 1.5767 1.2168 1.2680 1.2661 1.0863 1.0975 1.0403 1.0403 1.0598 1.0589 1.0584 1.0687 1.0700 1.0458 9.4801 9.6048 1.0380 1.0625 1.0600 1.0358 1.0358 1.0582 1.0581 1.0836 1.0972 1.0991 1.0994 1.1051 1.1066 1.0985 1.0983 1.0985 1.1024 1.1026
irintensity: 0.3973 0.5486 0.2521 0.4603 0.8314 0.5378 0.6071 0.7180 5.6737 9.3856 3.9574 9.2886 1.3398 1.9719 1.7615 12.0377 1.4923 7.8753 10.6869 2.5395 0.3235 8.2201 2.8166 1.5031 4.9165 3.2876 5.8142 4.5825 4.1725 3.5229 1.6802 8.1733 1.1692 20.2223 33.5930 42.0853 98.7084 52.1385 63.0757 211.1504 48.1930 8.7038 313.2557 72.5214 5.5101 13.7345 45.8356 83.7173 0.5168 0.1124 0.0507 84.7427 30.5739 33.2014 18.1078 10.9933 32.2600 14.4326 20.2511 16.7854 30.5712 18.8022 11.7363 12.0531 6.0887 2.6971 11.1348 13.3458 10.7674 19.3364 191.5812 140.3099 29.4029 15.2421 14.7306 24.3791 22.0261 19.5594 18.1644 3.5596 7.7903 6.8489 40.9809 18.9996 11.8051 32.6514 24.4709 29.4243 45.4182 45.0122
temp: 298.150 k
press: 1.00000 atm
elementType: 8 8 8 8 6 6 6 6 6 6 6 6 6 6 1 1 1 1 1 1 1 1 1 1 1 1 1 1 1 1 1 1
symmnumber: 1
zpe: 702963.3 jmol-1
zpe.correction: 0.267745 hartree
zpe.thermalcorrener: 0.284308 hartree
zpe.thermalcorrenthalpy: 0.285252 hartree
zpe.thermalcorrgfe: 0.221327 hartree
zpe.sumelectzpe: -691.643155 hartree
zpe.sumelectthermal: -691.626591 hartree
zpe.sumelectthermalent: -691.625647 hartree
zpe.sumelectthermalfe: -691.689573 hartree
dipole: 1.2445 -0.5785 -2.2497
dipole: 2.6353
quadrupole: -63.8541 -83.3395 -89.9051
quadrupole: 1.7968 3.3470 -1.3411
quadrupole: 15.1788 -4.3066 -10.8722 1.7968 3.3470 -1.3411
hfenergy: -691.9108994 hartree
pointgroup: C01 [X(C10H18O4)]
dipole: 0.4745943 0.4292405 0.8157681 debye
polarizability: 157.9103536|-0.0109794|111.3150013|3.7666029|-2.5233432|100.3632804 unknown
InChI: InChI=1S/C10H18O4/c1-4-13-9(11)6-8(3)7-10(12)14-5-2/h8H,4-7H2,1-3H3
charge 0 multiplicity 1
32 atoms
O  -3.184157 0.794795 0.258385
O  3.495516 0.265119 0.402195
O  -2.596784 -1.0313 -1.062638
O  1.764366 0.706151 -1.089984
C  -0.002499 -1.206453 0.310821
C  -0.911348 0.042634 0.40874
C  1.430431 -0.883052 0.795906
C  -0.572734 -2.3909 1.125494
C  -2.279978 -0.162055 -0.216957
C  2.192566 0.104186 -0.076652
C  -4.557584 0.749907 -0.332988
C  4.367998 1.211836 -0.362225
C  -5.354078 1.875908 0.318284
C  5.728699 1.209128 0.326311
H  0.041921 -1.501776 -0.754687
H  -1.04533 0.364307 1.458754
H  -0.434263 0.884235 -0.130367
H  2.032584 -1.810719 0.847171
H  1.414438 -0.485532 1.83097
H  -0.645279 -2.137318 2.201283
H  -1.578365 -2.663684 0.763202
H  0.071821 -3.284529 1.030822
H  -4.469052 0.870563 -1.428006
H  -4.989244 -0.247592 -0.132687
H  4.420409 0.865729 -1.410276
H  3.889129 2.207854 -0.353686
H  -6.383514 1.888774 -0.084218
H  -5.409853 1.738085 1.411706
H  -4.888993 2.855636 0.114912
H  6.415464 1.897488 -0.199283
H  5.640938 1.53982 1.375331
H  6.173774 0.199553 0.316165
