program: Gaussian 09
title: 000081252
version: EM64L-G09RevD.01
frameworkgroup: C1[X(C11H13NO)]
method: RPBEPBE
basis: SDD
operation: Freq
keyword: #p
keyword: freq=noraman
keyword: PBEPBE/SDD
title: #p freq=noraman PBEPBE/SDD
converged: YES YES NO NO
title: Mulliken charges:
elementType: O N C C C C C C C C C C C H H H H H H H H H H H H H
charge: -0.261525 -0.060117 -0.033167 -0.500259 0.185719 -0.700191 -0.705120 0.242206 0.030323 -0.371427 -0.344906 -0.213317 -0.224686 0.224732 0.226175 0.237716 0.211768 0.207137 0.234892 0.215303 0.210620 0.221365 0.252152 0.254738 0.230301 0.229567
chargesum: 0.00000
title: Mulliken charges with hydrogens summed into heavy atoms:
elementType: O N C C C C C C C C C C C
charge: -0.261525 -0.060117 0.191566 -0.036368 0.185719 -0.046393 -0.057832 0.242206 0.030323 -0.119276 -0.090168 0.016984 0.004882
polarizability: 1.85818750e+02 -9.32158782e-01 1.17019555e+02 1.41881858e+01 3.07690140e+00 7.78540260e+01
1716.lowfreq: -3.0396 -0.0004 -0.0003 0.0003 6.4956 7.9282 31.9332 49.0852 69.7218
frequency: 31.8238 49.0760 69.7195 162.3080 203.6990 226.5300 252.3310 267.7391 289.7406 312.4076 392.5929 408.1460 434.1109 469.3139 524.2850 576.2294 610.3041 645.9707 715.3636 752.9732 764.0227 792.8404 814.3521 826.0473 860.7749 861.8641 896.9922 922.8543 939.8988 941.8745 960.4245 980.2618 1002.6667 1079.3706 1090.2959 1128.3748 1136.6120 1159.9480 1174.0192 1188.5523 1226.4012 1254.4379 1278.4650 1286.3446 1328.0993 1337.4961 1381.8049 1399.0099 1401.9299 1436.2150 1442.1620 1458.3270 1466.4863 1471.4253 1482.2816 1484.5060 1552.4424 1613.3161 1621.1721 2969.4707 2974.5225 2989.4349 2993.4448 3062.0650 3066.2770 3071.7804 3075.6272 3077.4174 3138.5126 3155.7407 3173.0245 3180.5252
redmass: 3.2842 3.4576 3.4691 4.2548 1.0633 1.1564 6.2126 2.6262 2.4576 4.0090 2.6117 1.9839 2.8659 4.7002 5.9767 3.8631 7.1069 5.6702 5.0073 2.1731 1.8711 5.0455 2.8894 6.2113 5.5193 1.4270 1.7531 1.1954 1.9337 1.3952 1.4984 1.3049 2.0536 2.3339 2.2033 2.3320 1.8450 1.2761 1.8758 2.6867 2.0638 1.8665 1.4317 1.3529 1.3474 1.5221 1.2108 1.2136 4.2431 3.1333 1.1084 2.6589 1.0473 1.0521 1.0495 1.0523 9.0900 7.9342 8.0277 1.0356 1.0364 1.0827 1.0631 1.0996 1.0995 1.0998 1.0982 1.0993 1.0862 1.0913 1.0957 1.0992
irintensity: 0.0528 0.3500 0.7104 2.6200 0.1930 0.5439 0.3261 2.8714 0.3666 0.6514 1.5424 1.3519 4.1848 1.0505 0.3221 0.1921 0.9302 1.0674 2.2547 47.0110 62.3052 58.0398 0.2202 10.5758 3.6482 0.1794 6.7448 6.8531 4.3820 5.4077 0.1576 0.0147 12.4562 24.5179 3.5420 7.3632 20.7309 5.3767 30.4999 8.0768 31.4986 4.2026 2.5628 1.9214 5.2140 0.6352 16.8401 16.4846 5.3107 33.3602 8.1993 4.3251 0.4563 6.1441 9.9864 19.2968 81.9294 9.5236 4.4525 39.4017 23.6286 6.5424 20.3842 15.2744 6.0505 23.9844 67.4574 65.0607 3.2127 14.0419 12.3016 11.8186
temp: 298.150 k
press: 1.00000 atm
elementType: 8 7 6 6 6 6 6 6 6 6 6 6 6 1 1 1 1 1 1 1 1 1 1 1 1 1
symmnumber: 1
zpe: 560850.5 jmol-1
zpe.correction: 0.213617 hartree
zpe.thermalcorrener: 0.225503 hartree
zpe.thermalcorrenthalpy: 0.226447 hartree
zpe.thermalcorrgfe: 0.174810 hartree
zpe.sumelectzpe: -555.992621 hartree
zpe.sumelectthermal: -555.980735 hartree
zpe.sumelectthermalent: -555.979790 hartree
zpe.sumelectthermalfe: -556.031427 hartree
dipole: -0.1977 1.1388 0.3550
dipole: 1.2091
quadrupole: -64.2574 -77.3134 -79.6036
quadrupole: 0.3762 2.5971 -0.0091
quadrupole: 9.4674 -3.5886 -5.8788 0.3762 2.5971 -0.0091
hfenergy: -556.2062375 hartree
pointgroup: C01 [X(C11H13N1O1)]
dipole: -0.0727278 -0.3786411 -0.2786387 debye
dipolederiv: -0.9115954 0.1030418 0.1940513 -0.0135435 -0.5384597 -0.1814345 0.1837595 -0.2069959 -0.2259556 -0.6681427 -0.1678247 -0.0373809 -0.157159 -0.4004214 -0.0670906 0.0210397 -0.0405836 -0.2624501 0.193831 0.0055501 0.0484062 0.0477745 0.1399598 -0.0047023 0.2834387 0.0005523 0.1492055 -0.2271306 -0.0297782 -0.0343116 -0.117758 0.0802558 0.0131263 -0.1808551 -0.0059259 0.0271635 0.9046096 0.0214936 -0.0621938 -0.0075492 0.6732399 0.2828925 -0.2357134 0.2589105 0.1627038 -0.0021966 -0.0455356 0.0063428 -0.0481343 -0.0177914 0.0844016 -0.0452097 0.0919758 0.0065169 -0.0860319 -0.0320501 0.0117704 -0.0438932 0.0761509 0.0353872 -0.09797 0.0242528 0.0486656 0.4981365 0.0013576 -0.0955675 0.3529311 0.0231775 -0.0909028 0.0620108 -0.0221777 0.0517523 0.3182491 0.0310242 -0.0470403 -0.1832204 -0.0259456 0.0020237 -0.1380759 -0.0359792 0.0522766 -0.0427777 -0.0240349 -0.0325221 -0.0299764 0.0305133 0.086655 -0.0462995 0.093743 -0.1168769 0.0407359 0.0042925 -0.0343823 0.0553211 0.0837697 0.0968684 -0.0156927 0.0995246 -0.0920107 -0.061775 -0.0006356 -0.0411507 -0.0822099 0.016057 0.0967706 -0.061645 0.0836807 -0.1184336 0.0053357 0.0876419 -0.01225 0.1863007 -0.0640369 0.0158576 0.0388594 0.0301608 -0.1672266 0.0205156 0.0638866 0.0437833 0.0602709 -0.0804492 -0.0711551 0.0317657 -0.063506 -0.0167648 -0.0009908 -0.0163272 0.020267 -0.0235342 -0.0424639 0.1253604 0.037066 0.0860476 0.0115752 0.0220588 0.0292474 0.0240428 0.0507971 -0.0172561 -0.1085569 0.0242167 -0.0536913 0.0416638 -0.0073745 0.0081129 -0.1418584 -0.0070244 0.0732173 -0.0212655 -0.1555524 0.012079 -0.1046661 0.0550936 0.0754667 0.0404054 0.0636178 -0.0643135 -0.0562758 0.0799595 -0.1235853 0.0014343 -0.1330815 -0.0641138 0.0831638 -0.0709999 0.0479074 0.0197655 0.1041979 0.0151383 0.0791213 0.0755867 0.0005975 0.0104017 -0.0472429 -0.1066344 0.1282101 0.0542195 0.1358546 0.0076737 0.0381058 0.0225171 0.0346212 0.1017308 -0.0615675 -0.1216816 0.0883708 -0.0951919 0.0114821 -0.0773924 -0.0207809 -0.0962495 -0.0219095 0.0955587 -0.0120886 -0.1545158 -0.029457 -0.0848029 0.0938291 -0.0296467 0.0072769 -0.0042873 -0.018076 -0.0855757 0.0202884 -0.0824437 0.1400232 0.0979147 -0.0022678 0.0156973 -0.0337708 -0.0224583 -0.0794197 0.0029282 -0.0836597 0.1295445 -0.0544423 0.0692985 0.0789664 0.0660187 0.0612725 -0.0611963 0.0811155 -0.062622 0.1187743 -0.0910705 -0.0905328 0.0157106 -0.0925496 0.0587941 -0.0259736 0.0182933 -0.0261009 0.1496107 unknown
polarizability: 185.7087044|6.419806|111.075231|-13.1381392|14.3704096|83.9083956 unknown
InChI: InChI=1S/C11H13NO/c1-8(2)7-11-12-9-5-3-4-6-10(9)13-11/h3-6,8H,7H2,1-2H3
charge 0 multiplicity 1
26 atoms
O  -0.176805 -1.072287 0.005466
N  -0.03213 1.056895 0.919222
C  -3.153601 -0.222297 -0.389646
C  -2.295637 -0.120758 0.911754
C  -0.835217 0.039266 0.655136
C  -3.046627 1.066988 -1.235005
C  -4.622085 -0.528644 -0.018523
C  1.163952 -0.64173 -0.117147
C  1.253266 0.663459 0.445169
C  2.251209 -1.32461 -0.674649
C  2.488856 1.341569 0.458282
C  3.486946 -0.632939 -0.654767
C  3.602576 0.673348 -0.099857
H  -2.755461 -1.068742 -0.984557
H  -2.459124 -1.033052 1.518041
H  -2.623415 0.74781 1.510249
H  -3.630699 0.970785 -2.168612
H  -3.440633 1.936511 -0.674686
H  -1.999947 1.291362 -1.509054
H  -4.70749 -1.46695 0.561041
H  -5.053058 0.289214 0.590537
H  -5.242849 -0.633483 -0.927072
H  2.155079 -2.327406 -1.099012
H  2.572604 2.34457 0.886014
H  4.374598 -1.116163 -1.076774
H  4.578994 1.169286 -0.106951
