program: Gaussian 09
title: 000081226
version: EM64L-G09RevD.01
frameworkgroup: C1[X(C3H5NO4)]
method: RPBEPBE
basis: SDD
operation: Freq
keyword: #pfreq=noraman
keyword: PBEPBE/SDD
title: #p freq=noraman PBEPBE/SDD
converged: NO YES NO NO
title: Mulliken charges:
elementType: O O O O N C C C H H H H H
charge: -0.158985 -0.164366 -0.150452 -0.117993 0.202821 -0.316175 0.195195 -0.748907 0.254374 0.253762 0.271310 0.239338 0.240079
chargesum: 0.00000
title: Mulliken charges with hydrogens summed into heavy atoms:
elementType: O O O O N C C C
charge: -0.158985 -0.164366 -0.150452 -0.117993 0.202821 0.191960 0.195195 0.001820
polarizability: 7.89029261e+01 3.81523278e+00 6.26153694e+01 1.74656402e-02 -3.10614731e-02 3.19571575e+01
1716.lowfreq: -76.6388 -12.7858 -4.6179 -2.4675 -0.0007 -0.0006 0.0002 31.4921 73.2145
frequency: -76.6281 31.3549 73.1393 126.1206 147.2560 244.8639 328.6675 464.5531 510.0038 546.4181 627.2873 638.8872 754.2716 835.1242 851.9857 915.7420 989.6655 1057.0858 1156.0991 1177.5865 1189.5821 1316.8558 1374.1739 1435.6357 1447.2211 1455.4462 1527.5549 1660.1853 2983.6277 2991.3813 3047.6709 3069.7742 3129.5343
redmass: 1.3065 7.6132 2.6074 6.3830 2.9536 11.0040 4.0322 2.1986 4.8078 8.6795 7.8217 13.9435 13.2201 3.1792 1.3338 3.2189 3.8096 1.8803 4.0789 4.2263 1.1137 1.5393 1.2278 1.0658 1.0820 1.0483 13.7941 8.6130 1.0427 1.0507 1.1036 1.0971 1.0994
irintensity: 0.0029 3.4468 0.0073 5.2963 5.8643 0.5906 0.3180 0.0198 3.6448 1.8527 25.8843 6.6784 204.9676 6.9339 1.3627 55.0349 9.5241 2.0743 283.0883 14.3383 0.1066 71.8288 56.8523 1.9143 36.8848 25.5787 243.6429 102.5466 4.5015 16.3029 5.6011 13.7849 6.7158
temp: 298.150 k
press: 1.00000 atm
elementType: 8 8 8 8 7 6 6 6 1 1 1 1 1
symmnumber: 1
zpe: 227917.1 jmol-1
zpe.correction: 0.086809 hartree
zpe.thermalcorrener: 0.094907 hartree
zpe.thermalcorrenthalpy: 0.095851 hartree
zpe.thermalcorrgfe: 0.052440 hartree
zpe.sumelectzpe: -472.196458 hartree
zpe.sumelectthermal: -472.188360 hartree
zpe.sumelectthermalent: -472.187415 hartree
zpe.sumelectthermalfe: -472.230827 hartree
dipole: 2.8742 4.0228 0.0128
dipole: 4.9441
quadrupole: -48.4107 -52.3815 -43.0276
quadrupole: 6.5316 0.0454 0.0091
quadrupole: -0.4708 -4.4416 4.9123 6.5316 0.0454 0.0091
hfenergy: -472.2832669 hartree
pointgroup: C01 [X(C3H5N1O4)]
dipole: 1.1080218 -1.5987313 -0.0018674 debye
dipolederiv: -1.2331157 -0.0009606 0.0017676 -0.2151559 -0.2692898 0.0009447 0.0029379 0.0009026 -0.2173932 -0.5491755 -0.0531279 0.0006268 -0.0855356 -0.7956356 -0.002115 0.0009229 -0.0018137 -0.269086 -0.5200327 -0.0515661 0.0009979 -0.2206077 -0.8202515 0.0068105 0.0023915 0.0064052 -0.1465012 -0.932499 0.2663969 -0.0014626 0.3527937 -0.5489197 0.0035049 -0.0023517 0.0037567 -0.130357 2.2171718 -0.0978638 -0.0018051 0.203758 1.3985287 -0.0116064 -0.0045527 -0.0113276 0.2183408 0.0443012 -0.2065981 0.0012235 -0.5606195 0.0401385 0.0021659 0.0052814 0.0024062 0.3477092 1.2543475 -0.0252661 -0.0037486 0.2173287 1.0152235 0.0036382 -0.0047902 0.0033841 0.0917088 -0.4299855 0.2226899 0.0020757 0.1824741 -0.260622 -0.0029628 0.003046 -0.0040648 0.038611 0.0033209 0.0027938 -0.0049258 0.1047327 0.0354632 0.0643045 -0.0099583 0.0731081 -0.0171972 0.0021723 0.0034218 0.0054536 0.1051615 0.0327727 -0.065648 0.0080254 -0.074755 -0.0164038 -0.0637376 -0.0395282 -0.0010079 -0.0686443 0.0558979 -0.0009863 -0.0011119 -0.0004755 0.1321325 0.1036974 -0.0111855 0.0631104 -0.0084996 0.0562213 0.0893738 0.0180294 0.111014 -0.0139283 0.1035349 -0.0092063 -0.0623055 -0.0071861 0.0604728 -0.087424 -0.0178699 -0.1085404 -0.0176357 unknown
polarizability: 78.7902518|-4.0470694|62.727649|-0.0451241|-0.1053731|31.9575523 unknown
InChI: InChI=1S/C3H5NO4/c1-3(5)2-8-4(6)7/h2H2,1H3
charge 0 multiplicity 1
13 atoms
O  -0.558374 0.533654 -0.006281
O  2.017625 1.377507 0.003464
O  -2.064067 -1.319817 0.013108
O  -2.853984 0.835581 -0.006074
N  -1.969486 -0.051849 0.001081
C  0.464069 -0.528833 0.001578
C  1.853944 0.138168 -0.000241
C  3.006756 -0.858709 -0.006701
H  0.355301 -1.165932 0.900606
H  0.357356 -1.177316 -0.88946
H  3.963221 -0.314956 0.001313
H  2.958861 -1.523582 0.876396
H  2.963778 -1.504817 -0.90389
