program: Gaussian 09
title: 000081258
version: EM64L-G09RevD.01
frameworkgroup: C1[X(C11H14O3)]
method: RPBEPBE
basis: SDD
operation: Freq
keyword: #pfreq=noraman
keyword: PBEPBE/SDD
title: #p freq=noraman PBEPBE/SDD
converged: YES YES NO NO
title: Mulliken charges:
elementType: O O O C C C C C C C C C C C H H H H H H H H H H H H H H
charge: -0.276844 -0.266831 -0.240594 -0.297933 0.350398 0.440750 -0.292282 -0.373634 -0.336663 -0.330449 -0.422464 -0.808069 0.295722 -0.746865 0.219184 0.219332 0.244706 0.244548 0.248599 0.245255 0.230572 0.227433 0.222843 0.229564 0.228513 0.248732 0.248625 0.247850
chargesum: 0.00000
title: Mulliken charges with hydrogens summed into heavy atoms:
elementType: O O O C C C C C C C C C C C
charge: -0.276844 -0.266831 -0.240594 0.140583 0.350398 0.440750 0.196973 -0.125035 -0.091408 -0.099877 -0.195031 -0.127148 0.295722 -0.001658
polarizability: 1.95778932e+02 7.53864492e-01 1.25097709e+02 -1.24619110e-02 -3.33061579e-02 7.08134936e+01
1716.lowfreq: -42.4534 -4.7666 -0.0004 -0.0002 0.0007 5.7501 8.9725 22.1929 30.6537
frequency: -42.4482 21.9087 30.5574 38.8750 53.2311 64.9087 130.3933 149.4770 151.8926 186.7284 211.3255 286.7160 329.2903 351.1820 404.6957 414.2806 473.7315 507.1397 523.2441 563.6568 618.9207 634.6678 710.4106 728.5191 805.0809 808.6862 828.4836 833.3048 846.6871 931.4416 952.6844 963.5873 981.9478 1000.6784 1006.8690 1009.5163 1042.1973 1046.9365 1106.1134 1110.1099 1120.9408 1176.2352 1181.5896 1200.6962 1218.8322 1227.8656 1260.8320 1306.1647 1320.2669 1370.9126 1381.6992 1397.1221 1399.8808 1414.9896 1453.1601 1454.4716 1469.8677 1476.4511 1477.1212 1488.5869 1504.5775 1588.5527 1626.4618 1658.6837 2970.5930 2973.7654 3008.5107 3028.0528 3032.4780 3050.5369 3081.2140 3096.6546 3101.3828 3122.1279 3124.3032 3144.5307 3156.7399 3163.8361
redmass: 1.0461 6.3670 1.2650 2.5218 4.5673 3.5547 2.1504 6.1647 4.1380 2.9725 4.9125 3.5559 4.2810 3.2030 3.8391 2.9312 4.2443 2.4646 5.4206 3.0094 4.8034 6.7594 2.9958 5.2276 1.3515 6.0045 1.3693 1.1397 6.4689 1.3235 3.5862 1.3477 1.5699 4.7030 2.6173 2.7394 1.6621 1.5299 1.4792 2.8263 1.2571 1.1226 1.2600 3.2428 2.2422 6.2868 1.1368 1.2865 1.3002 3.8088 1.2682 1.3761 1.4373 3.4760 1.0610 1.0470 1.0455 1.0891 1.0990 1.1659 2.2551 6.5510 6.4334 9.5275 1.0554 1.0374 1.0368 1.0571 1.1076 1.0977 1.0985 1.0974 1.1095 1.0894 1.0890 1.1009 1.0945 1.0954
irintensity: 0.7578 0.2436 1.2688 0.2661 0.3429 0.4346 2.4641 2.1084 0.0245 11.9041 0.0413 7.8473 5.2398 11.7001 3.4252 0.0319 0.1001 21.3209 12.8785 3.0536 4.7883 0.0227 0.5774 23.3914 41.7154 17.5266 36.0597 0.0875 6.4192 1.0114 7.8541 0.6148 16.5766 34.5516 0.2997 199.9540 9.8074 11.4428 0.0446 5.4693 15.3679 2.6720 95.8470 547.1653 13.4068 64.5025 0.0023 1.1448 1.1080 3.7509 43.7351 4.4722 28.1231 1.6378 27.3564 18.7556 12.4379 6.6577 10.1741 65.1323 116.3226 14.3135 35.7114 202.4862 32.5507 44.6989 2.2013 13.7305 25.5761 23.9813 19.7239 6.8505 29.1634 16.4366 25.2958 10.4612 17.3627 4.4971
temp: 298.150 k
press: 1.00000 atm
elementType: 8 8 8 6 6 6 6 6 6 6 6 6 6 6 1 1 1 1 1 1 1 1 1 1 1 1 1 1
symmnumber: 1
zpe: 592694.4 jmol-1
zpe.correction: 0.225745 hartree
zpe.thermalcorrener: 0.240041 hartree
zpe.thermalcorrenthalpy: 0.240985 hartree
zpe.thermalcorrgfe: 0.181431 hartree
zpe.sumelectzpe: -652.180560 hartree
zpe.sumelectthermal: -652.166264 hartree
zpe.sumelectthermalent: -652.165320 hartree
zpe.sumelectthermalfe: -652.224874 hartree
dipole: -0.9157 -2.9056 -0.0094
dipole: 3.0465
quadrupole: -75.9296 -81.3924 -84.7281
quadrupole: -12.5691 -0.1120 -0.0550
quadrupole: 4.7538 -0.7090 -4.0448 -12.5691 -0.1120 -0.0550
hfenergy: -652.4063052 hartree
pointgroup: C01 [X(C11H14O3)]
dipole: -0.3640981 1.1412969 0.0381731 debye
polarizability: 195.7509698|-0.5881069|125.0288598|1.9863436|1.8714768|70.9103048 unknown
InChI: InChI=1S/C11H14O3/c1-9-3-5-11(6-4-9)14-8-7-13-10(2)12/h3-6H,7-8H2,1-2H3
charge 0 multiplicity 1
28 atoms
O  -0.012015 -0.792018 -0.10101
O  3.39738 0.536221 0.004445
O  5.019294 -1.135484 -0.043167
C  1.026254 0.242946 -0.048109
C  -1.354155 -0.361502 -0.107633
C  -4.131527 0.2876 -0.129036
C  2.349227 -0.518085 -0.052761
C  -2.323775 -1.392872 -0.156473
C  -1.761549 0.992212 -0.069057
C  -3.691529 -1.064816 -0.166546
C  -3.143774 1.298745 -0.08018
C  -5.613164 0.624086 -0.143683
C  4.724772 0.078037 0.003015
C  5.683585 1.246388 0.064765
H  0.958281 0.912255 -0.92875
H  0.928496 0.849477 0.874221
H  2.473681 -1.119361 -0.969633
H  2.44173 -1.184691 0.821797
H  -1.984882 -2.433187 -0.185012
H  -1.031532 1.806432 -0.030101
H  -4.433485 -1.872039 -0.204026
H  -3.452572 2.350735 -0.049763
H  -5.780268 1.712907 -0.075021
H  -6.099357 0.268608 -1.072114
H  -6.144306 0.149047 0.702713
H  5.508123 1.834258 0.982315
H  5.518764 1.92035 -0.79351
H  6.718305 0.875651 0.053614
