program: Gaussian 09
title: 000081242
version: EM64L-G09RevD.01
frameworkgroup: C1[X(C10H6ClNO3)]
method: RPBEPBE
basis: SDD
operation: Freq
keyword: #p
keyword: freq=noraman
keyword: PBEPBE/SDD
title: #p freq=noraman PBEPBE/SDD
converged: NO YES NO NO
title: Mulliken charges:
elementType: Cl O O O N C C C C C C C C C C H H H H H H
charge: -0.067485 -0.190212 -0.190605 -0.076136 -0.235621 0.186012 0.186305 0.115811 0.115567 -0.402974 -0.346709 -0.346732 -0.207142 -0.207205 0.028430 0.304220 0.304287 0.272282 0.272243 0.242828 0.242838
chargesum: 0.00000
title: Mulliken charges with hydrogens summed into heavy atoms:
elementType: Cl O O O N C C C C C C C C C C
charge: -0.067485 -0.190212 -0.190605 -0.076136 -0.235621 0.186012 0.186305 0.115811 0.115567 0.205532 -0.074427 -0.074489 0.035686 0.035633 0.028430
polarizability: 1.97102841e+02 -1.02182022e-02 1.30357427e+02 2.13619177e+01 5.09001397e-02 6.97563382e+01
1716.lowfreq: -5.9756 -4.7134 -0.0002 0.0007 0.0011 5.3285 27.0994 42.9526 44.1985
frequency: 26.9143 42.9461 44.1984 125.6366 138.7429 178.9942 210.5740 223.3837 247.2573 313.9520 339.8628 395.0186 413.8402 442.0434 455.6191 506.1967 523.0969 587.4857 659.1815 680.0649 690.7147 705.8689 766.8388 788.3392 803.4689 823.3439 909.7159 916.1805 921.2378 978.0622 980.7552 1010.0716 1020.4288 1071.6073 1091.0941 1171.3093 1172.5980 1210.6075 1284.9495 1296.4946 1324.6232 1355.4328 1401.7416 1417.2720 1454.3948 1454.6591 1613.2240 1618.2867 1639.8378 1685.3664 1769.3527 3025.0671 3090.0236 3142.8296 3155.7831 3167.1067 3176.9466
redmass: 7.1500 15.6102 9.3329 11.5514 5.0196 7.1961 15.5905 2.7433 4.4643 8.9829 9.9585 16.4494 3.1942 3.5794 4.7521 7.4085 7.2263 11.5896 4.8330 6.5740 6.5198 3.6946 3.4007 5.1788 2.0424 4.1706 1.4039 6.7936 3.7718 1.4129 4.9841 1.3512 2.0207 2.6493 3.0034 1.1626 1.9973 3.2135 1.4615 1.3529 1.6569 3.8184 1.1606 5.2706 2.7782 2.4614 7.6221 7.6113 12.4876 12.0745 11.1339 1.0593 1.1021 1.0867 1.0907 1.0958 1.1005
irintensity: 0.6403 0.3819 2.2375 6.8632 0.0194 0.9995 1.2370 4.1796 4.1084 0.0228 24.3016 16.8331 2.9362 0.0428 0.0196 78.4857 8.1964 51.6292 0.0031 0.2749 21.1182 49.3929 116.4477 0.0650 18.8186 0.1139 0.2975 89.1090 66.8082 1.9633 75.4917 0.0011 3.3884 24.2907 24.4672 10.3937 4.2056 34.1045 0.2657 13.0622 58.0719 317.1742 99.5718 16.1745 0.9047 13.2460 0.7953 36.1916 424.1986 60.8678 222.0889 13.1990 3.7046 1.5562 4.1036 4.1256 18.1458
temp: 298.150 k
press: 1.00000 atm
elementType: 17 8 8 8 7 6 6 6 6 6 6 6 6 6 6 1 1 1 1 1 1
symmnumber: 1
zpe: 368812.5 jmol-1
zpe.correction: 0.140473 hartree
zpe.thermalcorrener: 0.153188 hartree
zpe.thermalcorrenthalpy: 0.154133 hartree
zpe.thermalcorrgfe: 0.099085 hartree
zpe.sumelectzpe: -1124.134919 hartree
zpe.sumelectthermal: -1124.122204 hartree
zpe.sumelectthermalent: -1124.121260 hartree
zpe.sumelectthermalfe: -1124.176308 hartree
dipole: 5.3126 0.0202 -1.4654
dipole: 5.5110
quadrupole: -78.9414 -99.6974 -94.9708
quadrupole: -0.1826 8.1570 -0.0067
quadrupole: 12.2618 -8.4942 -3.7676 -0.1826 8.1570 -0.0067
hfenergy: -1124.2753922 hartree
pointgroup: C01 [X(C10H6Cl1N1O3)]
dipole: 2.0935387 -0.0801682 0.5583426 debye
dipolederiv: -1.2932286 0.0186199 0.1676818 0.0192737 -0.1304318 0.0027626 0.182468 0.0022407 -0.249541 -0.6071302 0.2560596 0.0679117 0.0931134 -0.9911595 -0.1023699 0.0557898 -0.101711 -0.3352221 -0.6219504 -0.2755903 0.042584 -0.1127176 -0.9939938 0.0311037 0.0496562 0.0311442 -0.3214974 -0.7671196 0.005616 0.1597002 -0.0087708 -0.16939 0.0357422 0.4087831 0.028852 -0.8610611 -1.3381132 0.0018203 0.0746525 -0.0066779 -1.165599 -0.0483787 0.1674878 -0.0498771 -0.2522366 -0.4631539 0.181456 0.0781878 0.2102971 -0.0844676 -0.0521298 0.1055988 -0.0525735 -0.0277972 -0.4790262 -0.174431 0.0618887 -0.206229 -0.0805685 0.0433852 0.0861053 0.0430518 -0.0177592 1.3286583 0.0152779 -0.1816938 0.2345817 1.4824554 0.1192719 -0.1816273 0.0783629 0.2833287 1.3215233 0.0084859 -0.1844101 -0.2078452 1.5003395 0.0139075 -0.207712 0.0537713 0.2759185 0.6942549 -0.011726 0.000178 0.0013627 0.0875687 0.0124814 -0.0862635 0.0125112 -0.0476157 -0.0988436 -0.0862113 0.0022184 0.1157074 0.1377292 -0.0044008 0.0099645 0.0282152 -0.0919213 -0.0981612 0.0944836 0.0119456 -0.1075747 0.1386875 0.0281803 -0.0023129 -0.0045777 -0.0918616 0.1259754 0.1133407 -0.0561287 0.07836 -0.0465435 -0.0061591 -0.0533974 -0.0198595 -0.1220828 0.1186527 -0.1131285 -0.0674616 -0.0788804 -0.0440002 0.0163271 -0.0605979 0.029812 -0.1184936 2.0592039 -0.0352022 -0.2294357 -0.016931 0.1363505 -0.052428 -0.5603079 -0.0429269 1.1242592 0.0039713 0.0041321 -0.0292738 0.083035 0.078115 -0.0569237 -0.0086451 -0.0177291 0.1175661 0.0072334 0.0033934 -0.0294984 -0.0834594 0.0738985 0.0497029 -0.0186965 0.0113558 0.1275047 0.1062757 0.0195337 0.0132869 -0.0214939 -0.0181032 -0.006274 0.0105291 -0.0142446 0.1554424 0.1061036 -0.0252868 0.0108814 0.0157684 -0.0183327 -0.0123096 0.0125373 -0.0042552 0.1556833 -0.0552516 -0.0721512 0.0399405 -0.0780642 0.0547423 0.0110204 0.0415736 0.0097034 0.1503642 -0.0498738 0.0715081 0.0468448 0.077145 0.0527032 -0.0225116 0.0490672 -0.0212659 0.1470226 unknown
polarizability: 196.7613552|-0.3263896|130.1925927|-22.3048055|3.4640162|70.262658 unknown
InChI: InChI=1S/C10H6ClNO3/c11-8(13)5-12-9(14)6-3-1-2-4-7(6)10(12)15/h1-4H,5H2
charge 0 multiplicity 1
21 atoms
Cl -4.955032 0.114308 -0.023988
O  -0.484839 2.331728 0.617049
O  -0.569938 -2.368217 0.375076
O  -2.729986 0.15016 -1.631814
N  -0.856163 -0.015755 0.562527
C  1.322154 0.6769 0.133166
C  1.296712 -0.738739 0.059502
C  -0.055447 1.165812 0.453628
C  -0.097935 -1.208134 0.330458
C  -2.284362 -0.005092 0.814411
C  2.505687 1.399721 -0.078685
C  2.453875 -1.477757 -0.228504
C  3.681244 0.660929 -0.372551
C  3.655739 -0.755212 -0.446353
C  -3.105764 0.093151 -0.4729
H  -2.549625 0.855469 1.45342
H  -2.580407 -0.934225 1.333792
H  2.513781 2.492456 -0.020121
H  2.422685 -2.570253 -0.283624
H  4.62405 1.19009 -0.546804
H  4.579275 -1.296838 -0.676482
