program: Gaussian 09
title: 000081210
version: EM64L-G09RevD.01
frameworkgroup: C1[X(C6H4N4O4)]
method: RPBEPBE
basis: SDD
operation: Freq
keyword: #pfreq=noraman
keyword: PBEPBE/SDD
title: #p freq=noraman PBEPBE/SDD
converged: NO NO NO NO
title: Mulliken charges:
elementType: O O O O N N N N C C C C C C H H H H
charge: -0.234530 -0.234542 -0.219844 -0.219835 -0.397753 -0.397747 -0.395267 -0.395263 0.195092 0.195092 0.150489 0.150489 0.142911 0.142913 0.381415 0.381416 0.377482 0.377483
chargesum: 0.00000
title: Mulliken charges with hydrogens summed into heavy atoms:
elementType: O O O O N N N N C C C C C C
charge: -0.234530 -0.234542 -0.219844 -0.219835 -0.016338 -0.016332 -0.017785 -0.017780 0.195092 0.195092 0.150489 0.150489 0.142911 0.142913
polarizability: 1.50187098e+02 1.21866417e+01 1.32286519e+02 8.20064260e-04 -1.23845498e-03 4.13931877e+01
1716.lowfreq: -10.4508 0.0005 0.0008 0.0009 7.5886 8.1574 72.8247 126.5300 169.3790
frequency: 72.8247 126.5300 169.3774 176.7229 183.5446 192.0884 302.4444 366.7253 377.6115 384.6074 427.7024 462.8553 504.1206 550.2073 587.4168 599.6124 668.7589 676.2772 694.3043 697.1017 730.5116 745.4278 752.2098 783.9615 786.5517 869.2468 898.7024 968.3247 1025.9625 1170.2754 1175.2653 1242.9900 1304.5876 1341.9447 1347.8317 1369.8561 1370.1447 1422.2231 1532.9403 1618.1414 1630.8359 1669.0055 1679.4640 1699.8552 3508.3873 3509.6438 3518.8889 3519.3248
redmass: 15.1881 10.6243 9.8727 5.8140 6.8817 11.1303 14.5483 12.3694 8.5418 13.4723 8.3147 5.9374 9.1424 9.7897 7.8754 7.6033 2.2526 2.4340 5.5511 2.1055 1.3920 1.9161 2.9597 2.5357 1.8057 6.1682 7.2372 3.1677 4.0707 3.5530 9.0589 10.1483 2.3406 6.6271 2.1494 1.6752 1.5650 2.4612 5.2456 7.4126 7.5817 8.7747 6.0299 6.2979 1.0775 1.0780 1.0773 1.0774
irintensity: 0.1904 5.4587 0.0000 6.6025 0.0000 13.7810 0.0000 41.6896 1.7582 0.0000 0.0000 0.0000 20.8617 0.0000 0.0000 30.2968 0.0000 48.3437 10.7176 8.1843 0.0000 63.8663 0.0000 0.0000 415.2330 0.0000 6.6366 0.0000 24.6774 0.0001 19.4009 0.0000 69.5539 348.0845 0.0000 32.8480 0.0004 84.3318 0.0000 0.0013 697.3794 0.0002 1596.2348 0.0005 0.0029 263.6453 148.8445 0.0014
temp: 298.150 k
press: 1.00000 atm
elementType: 8 8 8 8 7 7 7 7 6 6 6 6 6 6 1 1 1 1
symmnumber: 1
zpe: 307520.0 jmol-1
zpe.correction: 0.117128 hartree
zpe.thermalcorrener: 0.127738 hartree
zpe.thermalcorrenthalpy: 0.128682 hartree
zpe.thermalcorrgfe: 0.080570 hartree
zpe.sumelectzpe: -750.042935 hartree
zpe.sumelectthermal: -750.032326 hartree
zpe.sumelectthermalent: -750.031381 hartree
zpe.sumelectthermalfe: -750.079493 hartree
dipole: 0.0002 0.0001 0.0006
dipole: 0.0006
quadrupole: -96.2607 -91.4413 -78.0247
quadrupole: -8.2272 0.0010 0.0001
quadrupole: -7.6851 -2.8657 10.5509 -8.2272 0.0010 0.0001
hfenergy: -750.1600632 hartree
pointgroup: C01 [X(C6H4N4O4)]
dipole: 0.0000616 0.0000507 0.0002223 debye
dipolederiv: -0.5322695 0.0227275 -0.0000082 -0.031333 -1.2266363 -0.0000312 -0.0000057 0.0001023 -0.3531609 -0.5322746 0.0227211 -0.0000002 -0.0313366 -1.2266026 -0.0000031 -0.0000143 -0.0000602 -0.353166 -1.4533303 -0.3353131 -0.0000121 -0.3722023 -0.5710091 -0.0000004 -0.000096 -0.0000315 -0.3725262 -1.4533555 -0.3353172 0.0000843 -0.3722088 -0.5710073 0.0000368 0.0001114 0.0000376 -0.3725225 -1.3348254 -0.5085556 0.0000256 0.4046992 -0.4658195 -0.0000271 0.0000895 -0.0000481 -0.2804799 -1.3348327 -0.5085537 -0.0000306 0.4046965 -0.4658222 0.0000323 -0.0000461 0.000001 -0.2804744 -0.7588301 -0.3907485 0.0000135 -0.4428412 -0.8402043 -0.0000119 -0.0000202 -0.0000141 -0.3470356 -0.7588371 -0.3907496 -0.0000126 -0.4428438 -0.8401918 0.000035 0.0000152 0.0000515 -0.3470306 0.3628111 0.8869903 0.0000175 0.3274012 -0.1202011 0.0000235 -0.0000099 0.0000423 0.0589592 0.3628159 0.8869815 -0.0000051 0.3274074 -0.120178 -0.0000048 -0.0000034 -0.0000052 0.0589634 1.0628338 -0.1360398 0.0000367 0.0720859 1.6354028 0.0000218 0.000039 -0.0000787 0.2707785 1.0628264 -0.13603 0.0000354 0.0720928 1.6353429 0.0000524 0.0000251 0.0000764 0.2707703 2.195706 0.4555265 0.0000458 0.1268934 1.0675406 -0.000029 0.0001055 0.0000009 0.3345451 2.1957341 0.4555327 -0.000198 0.1269041 1.0675474 -0.0000999 -0.0002669 -0.0001051 0.3345511 0.225125 0.0487758 0.000009 -0.0169685 0.3325033 0.0000084 0.0000355 0.0000398 0.3411044 0.2251305 0.0487754 -0.0000048 -0.0169717 0.332508 -0.0000037 -0.0000023 -0.0000056 0.341103 0.2327846 -0.0433609 -0.0000087 -0.0677372 0.1884131 0.0000008 -0.0000015 0.0000037 0.3478103 0.2327878 -0.0433625 0.0000125 -0.0677374 0.1884138 0. 0.000045 -0.0000069 0.3478107 unknown
polarizability: 150.0685|12.2728619|132.405117|0.0008261|-0.0012345|41.3931877 unknown
InChI: InChI=1S/C6H4N4O4/c11-3-1-2(8-6(14)9-3)4(12)10-5(13)7-1/h7-10H
charge 0 multiplicity 1
18 atoms
O  -0.983318 2.850561 -0.000146
O  0.983301 -2.85059 -0.000056
O  -3.694175 -0.995768 -0.000163
O  3.694176 0.995726 -0.00021
N  1.358056 1.251133 0.000074
N  -1.358054 -1.251164 0.000002
N  -2.309935 0.904972 -0.000138
N  2.309933 -0.905013 0.000106
C  0.089206 0.684685 0.000036
C  -0.089206 -0.684712 0.000036
C  -1.078073 1.591245 -0.000004
C  1.078075 -1.591265 0.000053
C  -2.542036 -0.499081 -0.000066
C  2.542041 0.499048 -0.000037
H  1.431377 2.274659 0.000026
H  -1.431364 -2.27469 -0.000013
H  -3.158723 1.481442 -0.000256
H  3.158718 -1.481487 0.000055
