program: Orca
programVersion: 6.1.1
elementType: C C C C C C H H H H C C C C H C H C H H H C C C C H C H C H H N O H C H H H Br
keywords: DLPNO-CCSD(T) def2-TZVPP def2-TZVPPD/C VeryTightSCF xyzfile
charge: 1
multiplicity: 1
formula: C19H17BrNO
InChI: InChI=1/C19H17BrNO/c1-22-18-11-7-16(8-12-18)19(21-13-3-2-4-14-21)15-5-9-17(20)10-6-15/h2-14,19H,1H3
39 atoms
C  -3.192525 -1.977239 1.448317
C  -2.214333 -1.032899 1.674299
C  -1.807145 -0.166571 0.656805
C  -2.409984 -0.270302 -0.587854
C  -3.401933 -1.214698 -0.832262
C  -3.797121 -2.077795 0.189068
H  -3.513543 -2.651277 2.232337
H  -1.752362 -0.971445 2.654342
H  -2.116471 0.385645 -1.401329
H  -3.853732 -1.266997 -1.812575
C  -0.683056 0.802375 0.940309
C  -0.192325 2.481825 -0.848184
C  -2.005069 2.825121 0.586129
C  -0.487066 3.641752 -1.537629
H  0.640131 1.841289 -1.10083
C  -2.339416 3.99257 -0.057172
H  -2.568319 2.427138 1.419609
C  -1.569812 4.410555 -1.13923
H  0.135054 3.929228 -2.374201
H  -3.192531 4.56214 0.285294
H  -1.814981 5.326072 -1.663583
C  0.710782 0.285052 0.664058
C  1.791314 0.876441 1.318343
C  0.943424 -0.75463 -0.230044
C  3.08742 0.452273 1.073987
H  1.6223 1.675762 2.03337
C  2.238526 -1.188381 -0.483237
H  0.112662 -1.244114 -0.722675
C  3.302823 -0.579098 0.166537
H  3.924531 0.907623 1.586648
H  2.420054 -2.001166 -1.174173
N  -0.943367 2.097127 0.192221
O  -4.743742 -3.025478 0.065511
H  -0.728444 1.097191 1.990321
C  -5.385307 -3.179936 -1.19444
H  -6.096222 -3.992502 -1.069136
H  -5.919348 -2.268365 -1.476277
H  -4.662978 -3.443691 -1.971664
Br 5.055768 -1.163527 -0.171268
totalener: -3431.21336216888130 hartree
nucrepener: 2030.66490333087177 hartree
electener: -5461.87826549975307 hartree
oneelecener: -8766.00226631199803 hartree
twoeener: 3304.12400081224496 hartree
kineticenergy: 3430.31658447607560 hartree
energy: -13336.6309 -1775.6587 -1594.8476 -1594.8069 -1594.8052 -562.7475 -430.5848 -312.0016 -311.9964 -311.3592 -311.0847 -310.4634 -310.4596 -310.4309 -310.2990 -309.4198 -309.3898 -309.2179 -309.1252 -309.1145 -309.0482 -309.0333 -308.9923 -308.9437 -308.5959 -308.4531 -270.1413 -205.1702 -204.9741 -204.9696 -89.3305 -89.2291 -89.2189 -88.9746 -88.9741 -41.1456 -40.9355 -35.5916 -34.9225 -34.5185 -33.4454 -32.8517 -31.5167 -31.1643 -30.9550 -30.0986 -29.1389 -28.6351 -28.3663 -27.5958 -26.2125 -25.9860 -25.1722 -24.9722 -24.2224 -23.3917 -22.7313 -22.6717 -21.9685 -21.9365 -21.6481 -21.3066 -20.7682 -20.5786 -20.4936 -20.4017 -20.1861 -19.4920 -19.4163 -19.1576 -19.0512 -18.9760 -18.6115 -18.3239 -17.6071 -17.4600 -17.1410 -16.9926 -16.8269 -16.2964 -15.9436 -15.7156 -15.3720 -14.6596 -14.3512 -13.7518 -12.6619 -12.4671 -12.0038 -11.4387 -2.4542 -1.4126 -0.5001 -0.0751 0.2829 0.3168 0.5760 0.9571 1.1583 1.3855 1.4998 electronvolt
chargesum: 1.0000000
charge: -0.142697 -0.184221 0.020027 -0.143170 -0.176286 0.314132 0.124206 0.110507 0.099720 0.105188 0.184695 0.127040 0.134608 -0.172584 0.157051 -0.150689 0.146865 0.031466 0.144829 0.144209 0.153796 -0.010967 -0.257755 -0.093872 -0.054810 0.112867 -0.092612 0.133913 -0.009573 0.132468 0.131820 -0.045533 -0.357473 0.164241 -0.021473 0.108538 0.074808 0.076971 -0.020248
charge: 0.018114 0.014361 -0.107826 -0.004840 -0.016922 -0.168316 0.031365 0.029515 0.020706 0.018707 -0.024378 0.051407 0.049416 0.014735 0.043340 0.018493 0.047812 0.095526 0.039231 0.039799 0.046920 -0.090030 0.006783 0.017453 -0.016332 0.026667 -0.016114 0.030670 -0.334539 0.029280 0.029227 0.360942 0.244660 0.047932 -0.010375 0.014799 0.002769 0.003432 0.395609
qa: -0.1427 -0.1842 0.0200 -0.1432 -0.1763 0.3141 0.1242 0.1105 0.0997 0.1052 0.1847 0.1270 0.1346 -0.1726 0.1571 -0.1507 0.1469 0.0315 0.1448 0.1442 0.1538 -0.0110 -0.2578 -0.0939 -0.0548 0.1129 -0.0926 0.1339 -0.0096 0.1325 0.1318 -0.0455 -0.3575 0.1642 -0.0215 0.1085 0.0748 0.0770 -0.0202
va: 4.0076 4.0902 3.5421 3.9368 3.9411 4.0109 1.0180 1.0131 1.0106 1.0181 3.5909 3.9406 3.9275 4.0016 1.0056 3.9960 1.0036 3.9574 1.0025 1.0026 0.9928 3.6568 4.0866 3.9031 3.8889 1.0149 3.9396 1.0007 4.1106 1.0031 1.0053 3.4281 1.9724 0.9654 3.8735 1.0010 0.9908 0.9912 1.1682
e0: -3431.213362168 hartree
corrType: DLPNO BASED
energy: -3435.150513290109 hartree
dipole: -74.160929549 71.061190232 -3.099739318 15.185823203 -11.388933446 3.796889757 -0.986532433 0.279393032 -0.707139400
dipolemethod: SCF
magnitude: 4.952252195 au
magnitude: 12.587624724 debye
