program: Gaussian 09
title: 000081225
version: EM64L-G09RevD.01
frameworkgroup: C1[X(C10H13N5O4)]
method: RPBEPBE
basis: SDD
operation: Freq
keyword: #p
keyword: freq=noraman
keyword: PBEPBE/SDD
title: #p freq=noraman PBEPBE/SDD
converged: YES YES NO NO
title: Mulliken charges:
elementType: O O O O N N N N N C C C C C C C C C C H H H H H H H H H H H H H
charge: -0.283469 -0.449804 -0.450366 -0.436366 -0.394465 -0.059512 -0.031795 -0.058215 -0.610701 -0.155239 -0.169473 -0.268949 0.004924 0.317113 -0.355016 -0.110686 -0.075284 0.146730 -0.404112 0.302573 0.288465 0.241016 0.257853 0.206447 0.193673 0.358892 0.363235 0.363318 0.346522 0.242977 0.344900 0.334817
chargesum: 0.00000
title: Mulliken charges with hydrogens summed into heavy atoms:
elementType: O O O O N N N N N C C C C C C C C C C
charge: -0.283469 -0.090913 -0.087131 -0.089844 -0.031147 -0.059512 -0.031795 -0.058215 0.069016 0.147334 0.118991 -0.027933 0.262778 0.317113 0.045103 -0.110686 -0.075284 0.146730 -0.161136
polarizability: 2.04633764e+02 4.90908740e+00 1.62220976e+02 -1.77925303e+01 5.81080928e+00 1.02654231e+02
1716.lowfreq: -18.4263 -7.5848 -3.8401 0.0002 0.0004 0.0005 12.1001 24.4238 47.0150
frequency: 11.7256 23.7541 46.9886 93.6116 98.7398 105.8838 162.8417 177.4395 206.1107 224.4675 236.1864 255.9387 266.8077 277.2216 279.7543 316.4230 330.8597 345.6446 390.8247 470.5624 506.8134 509.1517 511.3203 543.5324 547.3129 565.7952 573.9915 601.3852 630.2386 657.4119 680.1440 695.7504 736.4375 760.1390 792.3259 800.9271 818.6718 866.9559 873.3252 896.6708 937.6757 965.4584 977.5468 1000.9917 1018.0097 1018.7519 1030.6245 1044.8016 1053.8103 1100.5637 1108.8620 1164.0910 1187.1784 1188.8925 1211.1280 1220.4707 1231.4257 1245.5485 1259.9660 1268.3404 1289.1764 1303.6431 1322.2294 1336.0328 1341.7925 1360.8746 1368.4202 1368.9692 1381.9498 1393.7830 1421.4742 1445.8330 1457.8431 1494.0165 1551.1686 1584.7318 1622.4866 2931.3377 2986.9235 2998.3166 3015.3344 3027.7526 3034.7135 3158.2063 3465.9970 3535.9331 3570.3934 3572.6728 3574.9382 3691.8731
redmass: 5.6665 6.5774 5.7648 6.4824 5.3622 5.3118 4.6192 3.7473 5.4840 1.8821 1.9789 4.7746 1.8539 3.7488 4.6001 2.3517 6.9353 5.0014 3.8525 2.8931 7.8666 1.1742 1.1743 4.2031 1.2747 4.0559 4.5289 6.2633 6.2581 6.5300 5.8006 7.7158 5.3536 1.2213 6.3450 3.9006 7.3473 6.7444 4.3485 3.6358 1.4214 2.3740 6.3860 2.8411 2.9301 4.7171 2.8773 3.8748 2.9052 1.9734 3.8914 1.2961 1.6482 1.9664 1.1259 2.8423 1.3613 1.5637 1.3362 1.3344 1.8369 1.3355 1.2444 4.4443 1.2958 3.5606 2.5818 1.7306 2.1279 1.5158 1.5745 3.0697 1.0825 5.0672 2.7372 5.9093 1.8572 1.0544 1.1049 1.0853 1.0891 1.0847 1.0868 1.0916 1.0648 1.0444 1.0666 1.0821 1.0665 1.1055
irintensity: 1.0894 4.8822 3.7520 7.4485 5.0490 10.1255 13.4112 10.6809 10.2325 68.1206 64.4791 12.8145 29.7757 17.2633 12.9224 31.8677 1.7340 3.9727 8.0117 3.9017 10.8103 111.8016 293.9428 4.3711 34.5642 8.5209 4.8304 18.4701 21.1345 21.1871 14.4278 9.0800 12.6860 113.5461 7.4369 4.5162 18.5510 12.7732 35.1548 131.9032 11.8154 9.0551 60.8535 71.3635 24.7701 31.5886 87.0457 40.5064 16.4285 16.9370 27.8366 35.8971 22.6060 10.7672 20.9222 11.6987 54.3784 35.5045 3.7312 25.4114 5.2418 17.2425 14.6242 31.7559 39.4778 46.8274 80.5468 7.3989 0.3423 0.8002 2.3527 9.1629 8.8986 36.9754 107.5022 33.2446 488.7328 50.6917 43.0557 17.9592 10.4090 13.2617 41.0320 20.6612 38.6878 125.9266 6.1554 128.8173 14.9558 47.3535
temp: 298.150 k
press: 1.00000 atm
elementType: 8 8 8 8 7 7 7 7 7 6 6 6 6 6 6 6 6 6 6 1 1 1 1 1 1 1 1 1 1 1 1 1
symmnumber: 1
zpe: 638405.4 jmol-1
zpe.correction: 0.243156 hartree
zpe.thermalcorrener: 0.260500 hartree
zpe.thermalcorrenthalpy: 0.261444 hartree
zpe.thermalcorrgfe: 0.196201 hartree
zpe.sumelectzpe: -962.053900 hartree
zpe.sumelectthermal: -962.036556 hartree
zpe.sumelectthermalent: -962.035612 hartree
zpe.sumelectthermalfe: -962.100855 hartree
dipole: 0.5282 2.5818 -4.6242
dipole: 5.3224
quadrupole: -109.1454 -104.1542 -107.4463
quadrupole: 10.1938 12.2126 0.9843
quadrupole: -2.2301 2.7611 -0.5310 10.1938 12.2126 0.9843
hfenergy: -962.297056 hartree
pointgroup: C01 [X(C10H13N5O4)]
dipole: -0.3468374 2.0500024 -0.2488975 debye
polarizability: 204.5917629|-16.0583977|104.8608168|-8.4537052|-13.1736084|160.0563915 unknown
InChI: InChI=1S/C10H13N5O4/c11-10-6-4(12-2-13-10)5(14-15-6)9-8(18)7(17)3(1-16)19-9/h2-3,7-9,14,16-18H,1,11H2
charge 0 multiplicity 1
32 atoms
O  1.90129 -0.653684 -1.311584
O  2.810773 -1.928681 1.364894
O  3.626282 0.666221 1.603534
O  3.551845 1.386916 -2.729878
N  -0.843322 -0.396789 -1.560291
N  -2.159118 0.037655 -1.543038
N  -1.451555 -0.755502 1.964239
N  -3.787033 0.024395 1.81812
N  -4.813959 0.666772 -0.206205
C  1.76879 -0.937959 1.106019
C  1.08661 -1.291992 -0.225606
C  2.429364 0.432447 0.782273
C  2.873485 0.287198 -0.692408
C  -0.322471 -0.770075 -0.336072
C  2.887328 1.612851 -1.442251
C  -1.381689 -0.575147 0.586969
C  -2.481703 -0.08567 -0.209243
C  -3.716253 0.207641 0.471826
C  -2.65954 -0.438005 2.477948
H  1.046127 -0.893612 1.942616
H  1.136197 -2.384446 -0.384603
H  1.690811 1.250354 0.90535
H  3.880621 -0.169115 -0.732771
H  3.451259 2.348064 -0.826443
H  1.843973 1.971616 -1.579243
H  3.598152 -1.433529 1.723621
H  3.366742 1.076448 2.466565
H  -0.305514 -0.370338 -2.428582
H  3.607598 2.241064 -3.227263
H  -2.779236 -0.557698 3.559414
H  -4.775086 0.799923 -1.21446
H  -5.668168 0.856979 0.314653
