program: Gaussian 09
title: 000081224
version: EM64L-G09RevD.01
frameworkgroup: C1[X(C12H12BrClO)]
method: RPBEPBE
basis: SDD
operation: Freq
keyword: #p
keyword: freq=noraman
keyword: PBEPBE/SDD
title: #p freq=noraman PBEPBE/SDD
converged: YES YES NO NO
title: Mulliken charges:
elementType: Br Cl O C C C C C C C C C C C C H H H H H H H H H H H H
charge: -0.010201 -0.019996 -0.154456 -0.218215 -0.464386 -0.458641 -0.419921 -0.428924 0.149032 0.452755 -0.319680 -0.355214 -0.223474 -0.234925 -0.216818 0.218616 0.273083 0.291134 0.214751 0.212260 0.242031 0.250122 0.210438 0.266389 0.261858 0.241112 0.241269
chargesum: 0.00000
title: Mulliken charges with hydrogens summed into heavy atoms:
elementType: Br Cl O C C C C C C C C C C C C
charge: -0.010201 -0.019996 -0.154456 -0.218215 0.027314 0.047245 0.034370 0.031635 0.149032 0.452755 -0.319680 -0.088825 0.038384 0.006187 0.024451
polarizability: 1.90545727e+02 1.83592597e+01 1.52264778e+02 -1.20842122e+01 1.05301407e+01 1.12866697e+02
1716.lowfreq: -6.3315 0.0006 0.0010 0.0014 2.4079 10.0390 31.5103 50.5595 80.2718
frequency: 31.4138 50.4829 80.1991 87.2275 125.2896 128.7270 139.8290 150.1326 192.4940 246.4248 267.6134 288.1432 308.4975 382.1152 410.0600 431.5843 474.9568 489.7069 560.6795 628.1807 635.4193 680.9756 699.5733 740.1627 755.6085 779.3123 800.7725 810.9947 873.8616 882.7223 897.3293 956.5820 959.6621 968.4006 992.0836 1016.7796 1024.0978 1031.2214 1063.3613 1095.4118 1125.2316 1137.1261 1173.5391 1175.6400 1196.9051 1202.0057 1224.6797 1236.1057 1266.9050 1280.2867 1291.5899 1310.2953 1321.9628 1366.1584 1415.3024 1450.2962 1454.1671 1460.8614 1470.5570 1487.7584 1560.1429 1572.5730 1598.4957 2972.7242 2980.9669 3013.1825 3026.9461 3064.4548 3087.4429 3103.4050 3108.3372 3141.3544 3152.5214 3165.6731 3177.6313
redmass: 7.8818 8.4176 2.9270 2.5024 12.5581 4.2484 7.3734 4.5786 3.5959 5.2891 4.1927 2.8626 5.4106 7.3088 7.5344 4.2552 4.2858 3.0003 4.9594 3.4941 4.0275 5.4647 4.2112 2.4119 1.6342 1.8162 1.7516 2.5422 1.4670 3.6359 2.7084 1.4595 1.5038 2.2231 1.3459 6.7625 1.5305 3.4126 2.6538 2.2451 1.7755 3.7388 1.4273 1.0647 1.3401 1.4553 1.9048 1.3971 1.5514 1.3282 1.2119 1.3928 1.5541 7.5668 2.2126 1.0791 2.3769 1.0806 1.0795 1.0923 7.7878 8.4324 6.9245 1.0690 1.0690 1.0595 1.0629 1.1033 1.1023 1.0934 1.0964 1.0859 1.0905 1.0952 1.1007
irintensity: 1.3978 0.4003 0.9743 0.3007 0.2920 0.9292 2.1041 0.2509 1.5357 2.4012 0.5928 3.8882 4.5361 3.7945 10.1589 6.2697 6.9308 9.7682 1.1628 9.8476 8.6931 16.5418 2.0582 39.1570 29.5565 53.9013 3.6666 12.7938 0.6255 18.9510 3.0283 2.5772 16.4757 5.7108 0.6350 27.7461 1.2316 14.8339 13.2707 17.3729 0.6249 4.7799 31.4630 0.9494 1.3734 17.2634 66.7580 25.3224 45.5535 1.7566 4.6099 2.1116 4.8949 3.0003 31.2214 9.8610 16.0004 12.4268 8.8438 7.8846 43.6866 72.5400 25.4671 4.7594 32.6783 30.1479 55.1817 1.1343 30.8434 6.2810 15.6728 1.2345 4.6224 7.2322 14.4223
temp: 298.150 k
press: 1.00000 atm
elementType: 35 17 8 6 6 6 6 6 6 6 6 6 6 6 6 1 1 1 1 1 1 1 1 1 1 1 1
symmnumber: 1
zpe: 543770.4 jmol-1
zpe.correction: 0.207111 hartree
zpe.thermalcorrener: 0.221491 hartree
zpe.thermalcorrenthalpy: 0.222435 hartree
zpe.thermalcorrgfe: 0.163909 hartree
zpe.sumelectzpe: -1012.112257 hartree
zpe.sumelectthermal: -1012.097878 hartree
zpe.sumelectthermalent: -1012.096934 hartree
zpe.sumelectthermalfe: -1012.155459 hartree
dipole: -2.8264 -2.6059 3.5429
dipole: 5.2280
quadrupole: -89.1131 -100.0351 -111.3809
quadrupole: 0.1412 -0.0121 -0.4421
quadrupole: 11.0633 0.1413 -11.2045 0.1412 -0.0121 -0.4421
hfenergy: -1012.3193683 hartree
pointgroup: C01[X(C12H12Br1Cl1O1)]
dipole: -0.849314 -1.7375491 0.7001499 debye
polarizability: 181.7685009|29.4110768|143.3421128|-3.8531065|22.6382206|130.5665887 unknown
InChI: InChI=1S/C12H12BrClO/c13-12(7-3-4-8-12)11(15)9-5-1-2-6-10(9)14/h1-2,5-6H,3-4,7-8H2
charge 0 multiplicity 1
27 atoms
Br 2.35734 1.996213 0.151697
Cl -1.018616 1.873306 1.590083
O  0.465057 0.513219 -2.228506
C  1.563458 0.090695 -0.106317
C  1.423548 -0.583068 1.272699
C  2.646583 -0.757794 -0.820471
C  2.854659 -1.083902 1.634694
C  3.664323 -1.112325 0.292656
C  0.315173 0.275049 -0.999227
C  -1.076941 -0.048893 -0.490681
C  -1.754097 0.516903 0.616267
C  -1.786831 -1.014669 -1.263299
C  -3.061645 0.127989 0.970779
C  -3.0861 -1.42984 -0.913954
C  -3.724284 -0.861563 0.212526
H  0.731712 -1.442202 1.152126
H  0.993495 0.081346 2.036092
H  3.077891 -0.238419 -1.688931
H  2.148452 -1.676245 -1.196204
H  2.810529 -2.07931 2.110936
H  3.33017 -0.396963 2.355203
H  4.469678 -0.358719 0.317891
H  4.133371 -2.094302 0.10713
H  -1.291142 -1.42356 -2.149842
H  -3.555783 0.605743 1.821558
H  -3.600246 -2.182315 -1.520155
H  -4.737054 -1.168775 0.493253
