program: Gaussian 09
title: 000081346
version: EM64L-G09RevD.01
frameworkgroup: C1[X(C14H14Cl4O4)]
method: RPBEPBE
basis: SDD
operation: Freq
keyword: #p
keyword: freq=noraman
keyword: PBEPBE/SDD
title: #p freq=noraman PBEPBE/SDD
converged: YES YES NO NO
title: Mulliken charges:
elementType: Cl Cl Cl Cl O O O O C C C C C C C C C C C C C C H H H H H H H H H H H H H H
charge: 0.055972 0.039401 0.066477 0.065728 -0.268362 -0.236486 -0.188995 -0.219919 0.355967 0.393215 -0.214949 -0.214292 -0.382162 -0.385008 -0.376384 -0.315008 0.134421 0.144565 -0.098274 -0.099023 -0.677566 -0.677021 0.236307 0.230498 0.231323 0.216488 0.207274 0.220375 0.221842 0.219007 0.215652 0.227351 0.215870 0.214963 0.230140 0.210613
chargesum: 0.00000
title: Mulliken charges with hydrogens summed into heavy atoms:
elementType: Cl Cl Cl Cl O O O O C C C C C C C C C C C C C C
charge: 0.055972 0.039401 0.066477 0.065728 -0.268362 -0.236486 -0.188995 -0.219919 0.355967 0.393215 0.251856 0.233518 0.045486 0.055841 -0.376384 -0.315008 0.134421 0.144565 -0.098274 -0.099023 -0.018693 -0.021305
polarizability: 2.72680897e+02 -1.50911769e+00 2.41990834e+02 -1.39265950e+01 -2.11337052e+00 1.25002611e+02
1716.lowfreq: -12.2094 -1.9498 -0.0018 0.0015 0.0022 2.8705 4.7111 21.1369 28.8026
frequency: -10.1539 21.1298 28.7830 35.9712 42.2519 52.0729 55.1732 71.6511 75.6176 87.1575 99.2252 116.5094 130.8418 153.6264 179.4189 194.0474 207.7093 214.8124 216.2428 218.9586 226.6448 230.7002 233.5859 280.9787 281.9861 303.6566 307.1344 320.7794 340.4408 365.7624 373.9258 442.7310 451.5181 547.7234 575.6503 606.1819 632.2162 652.6162 699.5970 729.0040 752.9869 754.5541 767.7909 773.4801 798.6508 849.5766 862.0669 876.1891 877.0718 885.9657 890.0588 939.8921 943.2927 1041.7340 1049.4566 1055.0049 1124.3600 1135.8460 1136.1204 1139.1429 1142.1570 1196.3353 1225.5569 1226.3297 1228.3395 1277.9867 1279.8544 1302.8271 1303.2772 1333.6573 1338.6098 1360.8167 1370.0652 1382.9426 1396.2618 1396.9683 1467.8623 1468.5156 1475.9705 1477.2678 1480.3904 1481.0365 1488.4832 1489.5862 1524.6843 1551.9844 1616.1193 1637.2300 2981.3318 2982.3672 2997.1156 2998.6565 3006.4457 3007.8820 3044.2690 3046.9752 3066.2177 3070.9029 3086.1495 3087.0282 3087.8251 3088.1240
redmass: 2.5459 4.9394 6.4114 2.0497 7.9626 2.9608 2.2181 9.9080 11.7480 6.3017 4.1180 4.3223 6.8283 5.3801 5.6708 9.2496 24.6996 3.0351 4.5669 1.6605 1.5444 2.6314 7.4516 11.1905 13.2923 4.4225 4.6291 21.4072 14.7390 10.1610 6.0886 5.4258 7.4028 10.8390 11.1077 11.9738 11.2623 11.2049 11.2775 10.2073 1.0896 1.1139 8.1716 11.5300 11.2686 11.0612 9.4145 1.1607 1.1627 2.5587 2.6089 3.2548 3.1697 5.4359 2.8732 4.0005 10.2164 2.1883 2.2284 1.4671 1.4853 7.5792 1.2845 5.7906 1.3431 1.0993 1.1008 1.3532 1.3609 8.7683 11.2498 2.1780 1.5884 3.3559 1.2143 1.2317 1.0777 1.0794 1.0619 1.0562 1.0411 1.0410 1.0850 1.0854 11.9614 11.9332 11.9973 12.2463 1.0363 1.0359 1.0607 1.0585 1.0568 1.0588 1.1010 1.1018 1.1042 1.1044 1.0995 1.1009 1.1043 1.1037
irintensity: 0.0464 0.0878 0.4268 0.0735 0.3758 0.7155 0.0844 0.4914 0.3033 1.8696 0.9515 0.0949 0.0596 2.1470 1.3749 0.4225 0.0375 1.3376 1.2473 1.0125 0.1328 0.6955 1.1844 1.0590 0.0749 14.6758 18.4409 0.3089 0.1594 0.0516 1.4624 0.0515 9.5972 9.4655 30.1986 28.6755 20.0216 22.6884 0.5100 5.3191 2.8563 6.4491 10.5871 6.6604 0.8187 18.2689 11.4543 2.0475 2.7938 11.7917 0.6503 19.9987 92.1982 31.4185 20.7886 6.7587 491.7734 2.7160 2.5851 1.1655 2.6242 228.3938 6.3564 408.9955 34.9154 0.0678 0.1412 8.1785 9.8790 76.8883 4.6971 33.6169 0.6031 30.3057 8.2237 13.5716 2.3615 0.5336 4.5934 1.3675 11.4835 14.9162 31.1113 4.6755 28.9775 20.2355 148.1302 208.6514 29.5474 36.5605 7.6698 7.4993 29.6347 35.4864 0.4930 2.1191 0.3292 1.8905 41.2347 54.8632 87.1108 44.2913
temp: 298.150 k
press: 1.00000 atm
elementType: 17 17 17 17 8 8 8 8 6 6 6 6 6 6 6 6 6 6 6 6 6 6 1 1 1 1 1 1 1 1 1 1 1 1 1 1
symmnumber: 1
zpe: 663506.8 jmol-1
zpe.correction: 0.252716 hartree
zpe.thermalcorrener: 0.276666 hartree
zpe.thermalcorrenthalpy: 0.277610 hartree
zpe.thermalcorrgfe: 0.195652 hartree
zpe.sumelectzpe: -2681.360144 hartree
zpe.sumelectthermal: -2681.336195 hartree
zpe.sumelectthermalent: -2681.335251 hartree
zpe.sumelectthermalfe: -2681.417208 hartree
dipole: -4.3706 1.4614 -2.5338
dipole: 5.2591
quadrupole: -137.4461 -152.8382 -163.6351
quadrupole: 0.6195 3.9995 5.5165
quadrupole: 13.8604 -1.5317 -12.3286 0.6195 3.9995 5.5165
hfenergy: -2681.6128602 hartree
pointgroup: C01 [X(C14H14Cl4O4)]
dipole: -1.7194864 0.5145985 -1.029388 debye
polarizability: 271.9589967|-4.4136812|240.2240011|-16.4325326|-14.8180427|127.491344 unknown
InChI: InChI=1S/C14H14Cl4O4/c1-3-5-21-13(19)7-8(14(20)22-6-4-2)10(16)12(18)11(17)9(7)15/h3-6H2,1-2H3
charge 0 multiplicity 1
36 atoms
Cl 2.700411 -3.163314 -0.084407
Cl 1.438342 3.133779 0.049837
Cl 4.999597 -1.048407 -0.781879
Cl 4.371104 2.095085 -0.715594
O  -1.186528 -1.736808 -0.044008
O  -1.238976 1.589826 -0.379181
O  0.07503 -2.795908 1.609355
O  -1.177968 0.690759 1.77148
C  1.033374 -0.954965 0.300833
C  0.741561 0.436447 0.275139
C  -2.380734 -2.546023 0.35886
C  -2.602632 2.147617 -0.10949
C  -3.501616 -2.215602 -0.625765
C  -3.062993 2.839714 -1.391505
C  2.335634 -1.399451 -0.025177
C  1.767469 1.358971 -0.026061
C  -0.038711 -1.935463 0.713238
C  -0.643904 0.905615 0.659465
C  3.353556 -0.473448 -0.352368
C  3.072171 0.913523 -0.339411
C  -4.788719 -3.00009 -0.285273
C  -4.463511 3.467743 -1.212418
H  -2.636226 -2.272966 1.399524
H  -2.100019 -3.614957 0.334703
H  -2.526864 2.845911 0.744593
H  -3.265602 1.311452 0.182477
H  -3.700878 -1.127376 -0.597612
H  -3.167245 -2.455506 -1.65205
H  -2.327438 3.618271 -1.66561
H  -3.075637 2.103693 -2.216607
H  -5.150781 -2.758479 0.731293
H  -5.595478 -2.754439 -0.99786
H  -4.619008 -4.091743 -0.333132
H  -4.464596 4.227801 -0.40907
H  -4.789293 3.963091 -2.143637
H  -5.220395 2.703045 -0.955685
